Test run details - MTFirstReleaseCredentials - 6/17/2017 8:44:49 PM

Failed Tests | Skipped Tests | Notfound Tests | Passed Tests

Failed tests
Result Test      Search Duration Error
OfficeDevPnP.Core.Tests.Framework.Functional.LocalizationNoScriptTest.WebLocalizationTest N/A Class Initialization method OfficeDevPnP.Core.Tests.Framework.Functional.LocalizationNoScriptTest.ClassInit threw exception. System.Threading.ThreadAbortException: System.Threading.ThreadAbortException: Thread was being aborted..
OfficeDevPnP.Core.Tests.Framework.Functional.LocalizationNoScriptTest.SiteCollectionsLocalizationTest N/A Test 'SiteCollectionsLocalizationTest' exceeded execution timeout period.
OfficeDevPnP.Core.Tests.Framework.Functional.ContentTypeTests.SiteCollectionContentTypeAddingTest N/A Test 'SiteCollectionContentTypeAddingTest' exceeded execution timeout period.
OfficeDevPnP.Core.Tests.Framework.Functional.FilesNoScriptTests.WebCollectionDirectoryFilesTest N/A Class Initialization method OfficeDevPnP.Core.Tests.Framework.Functional.FilesNoScriptTests.ClassInit threw exception. System.Threading.ThreadAbortException: System.Threading.ThreadAbortException: Thread was being aborted..
OfficeDevPnP.Core.Tests.Framework.Functional.FilesNoScriptTests.WebFilesTest N/A Class Initialization method OfficeDevPnP.Core.Tests.Framework.Functional.FilesNoScriptTests.ClassInit threw exception. System.Threading.ThreadAbortException: System.Threading.ThreadAbortException: Thread was being aborted..
OfficeDevPnP.Core.Tests.Framework.Functional.FilesNoScriptTests.SiteCollectionDirectoryFilesTest N/A Class Initialization method OfficeDevPnP.Core.Tests.Framework.Functional.FilesNoScriptTests.ClassInit threw exception. System.Threading.ThreadAbortException: System.Threading.ThreadAbortException: Thread was being aborted..
OfficeDevPnP.Core.Tests.Framework.Functional.FilesNoScriptTests.SiteCollectionFilesTest N/A Test 'SiteCollectionFilesTest' exceeded execution timeout period.
OfficeDevPnP.Core.Tests.Framework.Functional.FieldNoScriptTests.SiteCollectionFieldAddingTest 00:00:11
Microsoft.SharePoint.Client.Tests.FeatureExtensionsTests.PublishingFeatureActivationTest 00:44:43 Test 'PublishingFeatureActivationTest' exceeded execution timeout period.
Page 1 of 1

Notfound tests
Result Test Duration Error
No data found