Test run details - AzureVMSP2019Credentials - 1/13/2021 6:05:24 PM

Failed Tests | Skipped Tests | Notfound Tests | Passed Tests

Failed tests
Result Test      Search Duration Error
OfficeDevPnP.Core.Tests.Sites.SiteCollectionTests.CreateTeamNoGroupSiteTestAsync 00:00:00 Test method OfficeDevPnP.Core.Tests.Sites.SiteCollectionTests.CreateTeamNoGroupSiteTestAsync threw exception: System.Exception: {"error":{"code":"-1, Microsoft.SharePoint.Client.UnknownError","message":"Unknown Error"}} TestCleanup method OfficeDevPnP.Core.Tests.Sites.SiteCollectionTests.CleanUp threw exception. Microsoft.SharePoint.Client.ServerException: Microsoft.SharePoint.Client.ServerException: File Not Found..
OfficeDevPnP.Core.Tests.Sites.SiteCollectionTests.CreateCommunicationSiteTestAsync 00:00:00 Test method OfficeDevPnP.Core.Tests.Sites.SiteCollectionTests.CreateCommunicationSiteTestAsync threw exception: System.Exception: {"error":{"code":"-1, Microsoft.SharePoint.Client.UnknownError","message":"Unknown Error"}} TestCleanup method OfficeDevPnP.Core.Tests.Sites.SiteCollectionTests.CleanUp threw exception. Microsoft.SharePoint.Client.ServerException: Microsoft.SharePoint.Client.ServerException: File Not Found..
OfficeDevPnP.Core.Tests.Sites.ALMTests.DeployRetractAppAsyncTest 00:00:00 Test method OfficeDevPnP.Core.Tests.Sites.ALMTests.DeployRetractAppAsyncTest threw exception: System.Exception: {"odata.error":{"code":"-2130575312, Microsoft.SharePoint.SPException","message":{"lang":"en-US","value":"The URL 'AppCatalog/appalmskip-8359756f-1ecd-4cf6-bbb1-0c57daeaeb26.sppkg' is invalid. It may refer to a nonexistent file or folder, or refer to a valid file or folder that is not in the current Web."}}}
OfficeDevPnP.Core.Tests.Sites.ALMTests.DeployRetractAppTest 00:00:00 Test method OfficeDevPnP.Core.Tests.Sites.ALMTests.DeployRetractAppTest threw exception: System.Exception: {"odata.error":{"code":"-2130575312, Microsoft.SharePoint.SPException","message":{"lang":"en-US","value":"The URL 'AppCatalog/appalmskip-e9ef98f9-981c-41c2-a7c1-31d197681a9d.sppkg' is invalid. It may refer to a nonexistent file or folder, or refer to a valid file or folder that is not in the current Web."}}}
OfficeDevPnP.Core.Tests.Sites.ALMTests.AddCheckRemoveAppTest 00:00:00 Test method OfficeDevPnP.Core.Tests.Sites.ALMTests.AddCheckRemoveAppTest threw exception: System.Exception: {"odata.error":{"code":"-2130575312, Microsoft.SharePoint.SPException","message":{"lang":"en-US","value":"The URL 'AppCatalog/app-577ef419-9a94-4df1-b536-39072136a0c7.sppkg' is invalid. It may refer to a nonexistent file or folder, or refer to a valid file or folder that is not in the current Web."}}}
OfficeDevPnP.Core.Tests.Sites.ALMTests.AddCheckRemoveAppTestAsync 00:00:00 Test method OfficeDevPnP.Core.Tests.Sites.ALMTests.AddCheckRemoveAppTestAsync threw exception: System.Exception: {"odata.error":{"code":"-2130575312, Microsoft.SharePoint.SPException","message":{"lang":"en-US","value":"The URL 'AppCatalog/app-5e222e0e-ae97-4934-9cd2-a238b1868902.sppkg' is invalid. It may refer to a nonexistent file or folder, or refer to a valid file or folder that is not in the current Web."}}}
OfficeDevPnP.Core.Tests.AppModelExtensions.PageExtensionsTests.CreatedPublishingPagesSetsTitleCorrectlyTest 00:00:00 Test method OfficeDevPnP.Core.Tests.AppModelExtensions.PageExtensionsTests.CreatedPublishingPagesSetsTitleCorrectlyTest threw exception: Microsoft.SharePoint.Client.ServerException: The Web site address "/sites/pnptest/WebExtensions" is already in use.
OfficeDevPnP.Core.Tests.AppModelExtensions.PageExtensionsTests.CanCreatePublishedPublishingPageWhenModerationIsDisabledTest 00:00:00 Test method OfficeDevPnP.Core.Tests.AppModelExtensions.PageExtensionsTests.CanCreatePublishedPublishingPageWhenModerationIsDisabledTest threw exception: Microsoft.SharePoint.Client.ServerException: The Web site address "/sites/pnptest/WebExtensions" is already in use.
OfficeDevPnP.Core.Tests.AppModelExtensions.PageExtensionsTests.CanCreatePublishedPublishingPageWhenModerationIsEnabledTest 00:00:00 Test method OfficeDevPnP.Core.Tests.AppModelExtensions.PageExtensionsTests.CanCreatePublishedPublishingPageWhenModerationIsEnabledTest threw exception: Microsoft.SharePoint.Client.ServerException: The Web site address "/sites/pnptest/WebExtensions" is already in use.
OfficeDevPnP.Core.Tests.AppModelExtensions.PageExtensionsTests.PublishingPageWithInvalidCharsIsCorrectlyCreatedTest 00:00:00 Test method OfficeDevPnP.Core.Tests.AppModelExtensions.PageExtensionsTests.PublishingPageWithInvalidCharsIsCorrectlyCreatedTest threw exception: Microsoft.SharePoint.Client.ServerException: The Web site address "/sites/pnptest/WebExtensions" is already in use.

Skipped tests
Result Test      Search Duration Error
OfficeDevPnP.Core.Tests.Authentication.HighTrustAuthenticationTests.CertificateFromStoreAppOnlyAuthenticationTest 00:00:00 Assert.Inconclusive failed. Not enough information to execute this test is passed via the app.config file.
OfficeDevPnP.Core.Tests.Authentication.HighTrustAuthenticationTests.CertificateFileAppOnlyAuthenticationTest 00:00:00 Assert.Inconclusive failed. Not enough information to execute this test is passed via the app.config file.
OfficeDevPnP.Core.Tests.Framework.Providers.BaseTemplateTests.DumpSingleTemplate N/A
OfficeDevPnP.Core.Tests.Framework.Providers.BaseTemplateTests.DumpBaseTemplates N/A
OfficeDevPnP.Core.Tests.Framework.Providers.BaseTemplateTests.ExtractSingleBaseTemplate2 N/A
OfficeDevPnP.Core.Tests.Framework.Providers.BaseTemplateTests.ExtractBaseTemplates2 N/A
OfficeDevPnP.Core.Tests.Framework.Providers.BaseTemplateTests.ExtractSingleTemplate2 N/A
OfficeDevPnP.Core.Tests.Framework.Providers.BaseTemplateTests.ExtractOtherTemplatesForRelease N/A
OfficeDevPnP.Core.Tests.Framework.Providers.BaseTemplateTests.ExtractMinimalTemplateSetForRelease N/A
OfficeDevPnP.Core.Tests.Utilities.HttpHelperTests.MakePostRequestForStringWithSPContextTest 00:00:00 Assert.Inconclusive failed. No value set for HttpHelperFunctionAppUrl property in the config file
Page 1 of 3

Notfound tests
Result Test Duration Error
No data found