Test run details - AzureVMSP2013AppOnly - 1/12/2021 8:53:33 PM

Failed Tests | Skipped Tests | Notfound Tests | Passed Tests

Failed tests
Result Test      Search Duration Error
OfficeDevPnP.Core.Tests.AppModelExtensions.PageExtensionsTests.CreatedPublishingPagesSetsTitleCorrectlyTest 00:00:00 Test method OfficeDevPnP.Core.Tests.AppModelExtensions.PageExtensionsTests.CreatedPublishingPagesSetsTitleCorrectlyTest threw exception: Microsoft.IdentityModel.SecurityTokenService.RequestFailedException: Token request failed. ---> System.Net.WebException: The remote server returned an error: (401) Unauthorized.
OfficeDevPnP.Core.Tests.AppModelExtensions.PageExtensionsTests.CanCreatePublishedPublishingPageWhenModerationIsDisabledTest 00:00:00 Test method OfficeDevPnP.Core.Tests.AppModelExtensions.PageExtensionsTests.CanCreatePublishedPublishingPageWhenModerationIsDisabledTest threw exception: Microsoft.IdentityModel.SecurityTokenService.RequestFailedException: Token request failed. ---> System.Net.WebException: The remote server returned an error: (401) Unauthorized.
OfficeDevPnP.Core.Tests.AppModelExtensions.PageExtensionsTests.CanCreatePublishedPublishingPageWhenModerationIsEnabledTest 00:00:00 Test method OfficeDevPnP.Core.Tests.AppModelExtensions.PageExtensionsTests.CanCreatePublishedPublishingPageWhenModerationIsEnabledTest threw exception: Microsoft.IdentityModel.SecurityTokenService.RequestFailedException: Token request failed. ---> System.Net.WebException: The remote server returned an error: (401) Unauthorized.
OfficeDevPnP.Core.Tests.AppModelExtensions.PageExtensionsTests.PublishingPageWithInvalidCharsIsCorrectlyCreatedTest 00:00:00 Test method OfficeDevPnP.Core.Tests.AppModelExtensions.PageExtensionsTests.PublishingPageWithInvalidCharsIsCorrectlyCreatedTest threw exception: Microsoft.IdentityModel.SecurityTokenService.RequestFailedException: Token request failed. ---> System.Net.WebException: The remote server returned an error: (401) Unauthorized.
OfficeDevPnP.Core.Tests.AppModelExtensions.PageExtensionsTests.CanCreatePublishingPageTest 00:00:00 Test method OfficeDevPnP.Core.Tests.AppModelExtensions.PageExtensionsTests.CanCreatePublishingPageTest threw exception: Microsoft.IdentityModel.SecurityTokenService.RequestFailedException: Token request failed. ---> System.Net.WebException: The remote server returned an error: (401) Unauthorized.
OfficeDevPnP.Core.Tests.AppModelExtensions.PageExtensionsTests.ProveThatWeCanAddHtmlToPageAfterChangingLayoutTest 00:00:00 Test method OfficeDevPnP.Core.Tests.AppModelExtensions.PageExtensionsTests.ProveThatWeCanAddHtmlToPageAfterChangingLayoutTest threw exception: Microsoft.IdentityModel.SecurityTokenService.RequestFailedException: Token request failed. ---> System.Net.WebException: The remote server returned an error: (401) Unauthorized.
OfficeDevPnP.Core.Tests.AppModelExtensions.PageExtensionsTests.CanAddHtmlToWikiPageTest 00:00:00 Test method OfficeDevPnP.Core.Tests.AppModelExtensions.PageExtensionsTests.CanAddHtmlToWikiPageTest threw exception: Microsoft.IdentityModel.SecurityTokenService.RequestFailedException: Token request failed. ---> System.Net.WebException: The remote server returned an error: (401) Unauthorized.
OfficeDevPnP.Core.Tests.AppModelExtensions.PageExtensionsTests.CanAddLayoutToWikiPageTest 00:00:00 Test method OfficeDevPnP.Core.Tests.AppModelExtensions.PageExtensionsTests.CanAddLayoutToWikiPageTest threw exception: Microsoft.IdentityModel.SecurityTokenService.RequestFailedException: Token request failed. ---> System.Net.WebException: The remote server returned an error: (401) Unauthorized.
OfficeDevPnP.Core.Tests.AppModelExtensions.PageExtensionsTests.EnsureWikiPageTest 00:00:00 Test method OfficeDevPnP.Core.Tests.AppModelExtensions.PageExtensionsTests.EnsureWikiPageTest threw exception: Microsoft.IdentityModel.SecurityTokenService.RequestFailedException: Token request failed. ---> System.Net.WebException: The remote server returned an error: (401) Unauthorized.
OfficeDevPnP.Core.Tests.AppModelExtensions.PageExtensionsTests.AddWikiPageTest 00:00:00 Test method OfficeDevPnP.Core.Tests.AppModelExtensions.PageExtensionsTests.AddWikiPageTest threw exception: Microsoft.IdentityModel.SecurityTokenService.RequestFailedException: Token request failed. ---> System.Net.WebException: The remote server returned an error: (401) Unauthorized.

Skipped tests
Result Test      Search Duration Error
OfficeDevPnP.Core.Tests.Authentication.HighTrustAuthenticationTests.CertificateFromStoreAppOnlyAuthenticationTest 00:00:00 Assert.Inconclusive failed. Not enough information to execute this test is passed via the app.config file.
OfficeDevPnP.Core.Tests.Authentication.HighTrustAuthenticationTests.CertificateFileAppOnlyAuthenticationTest 00:00:00 Assert.Inconclusive failed. Not enough information to execute this test is passed via the app.config file.
OfficeDevPnP.Core.Tests.AppModelExtensions.SearchExtensionsTests.TestSiteSearchTest 00:00:00 Assert.Inconclusive failed. Search tests are not supported when testing using app-only
OfficeDevPnP.Core.Tests.AppModelExtensions.SearchExtensionsTests.GetSearchConfigurationFromSiteTest 00:00:00 Assert.Inconclusive failed. Search tests are not supported when testing using app-only
OfficeDevPnP.Core.Tests.AppModelExtensions.SearchExtensionsTests.GetSearchConfigurationFromWebTest 00:00:00 Assert.Inconclusive failed. Search tests are not supported when testing using app-only
OfficeDevPnP.Core.Tests.AppModelExtensions.SearchExtensionsTests.SetSiteCollectionSearchCenterUrlTest 00:00:00 Assert.Inconclusive failed. Search tests are not supported when testing using app-only
OfficeDevPnP.Core.Tests.Framework.CanProvisionRules.CanProvisionTests.CanProvisionHierarchy 00:00:00 Assert.Inconclusive failed. Template requires term store work, so this will not work in app-only
OfficeDevPnP.Core.Tests.Framework.CanProvisionRules.CanProvisionTests.CanProvisionSite 00:00:00 Assert.Inconclusive failed. Template requires term store work, so this will not work in app-only
OfficeDevPnP.Core.Tests.Framework.ObjectHandlers.ObjectTermGroupsTests.CanProvisionTokenizedTermsTwiceNameMatch 00:00:00 Assert.Inconclusive failed. Taxonomy tests are not supported when testing using app-only
OfficeDevPnP.Core.Tests.Framework.ObjectHandlers.ObjectTermGroupsTests.CanProvisionTokenizedTermsTwiceIdMatch 00:00:00 Assert.Inconclusive failed. Taxonomy tests are not supported when testing using app-only
Page 1 of 7

Notfound tests
Result Test Duration Error
No data found