Test run details - MTFirstReleaseCredentials - 1/12/2021 6:45:07 PM

Failed Tests | Skipped Tests | Notfound Tests | Passed Tests

Failed tests
Result Test      Search Duration Error
OfficeDevPnP.Core.Tests.Sites.SiteCollectionTests.CreateTeamNoGroupSiteTestAsync 00:00:00 Test method OfficeDevPnP.Core.Tests.Sites.SiteCollectionTests.CreateTeamNoGroupSiteTestAsync threw exception: System.IO.FileNotFoundException: Could not load file or assembly 'System.Net.Http, Version=4.2.0.0, Culture=neutral, PublicKeyToken=b03f5f7f11d50a3a' or one of its dependencies. The system cannot find the file specified.WRN: Assembly binding logging is turned OFF. To enable assembly bind failure logging, set the registry value [HKLM\Software\Microsoft\Fusion!EnableLog] (DWORD) to 1. Note: There is some performance penalty associated with assembly bind failure logging. To turn this feature off, remove the registry value [HKLM\Software\Microsoft\Fusion!EnableLog].
OfficeDevPnP.Core.Tests.Sites.SiteCollectionTests.CreateCommunicationSiteTestAsync 00:00:00 Test method OfficeDevPnP.Core.Tests.Sites.SiteCollectionTests.CreateCommunicationSiteTestAsync threw exception: System.IO.FileNotFoundException: Could not load file or assembly 'System.Net.Http, Version=4.2.0.0, Culture=neutral, PublicKeyToken=b03f5f7f11d50a3a' or one of its dependencies. The system cannot find the file specified.WRN: Assembly binding logging is turned OFF. To enable assembly bind failure logging, set the registry value [HKLM\Software\Microsoft\Fusion!EnableLog] (DWORD) to 1. Note: There is some performance penalty associated with assembly bind failure logging. To turn this feature off, remove the registry value [HKLM\Software\Microsoft\Fusion!EnableLog].
OfficeDevPnP.Core.Tests.Sites.ALMTests.DeployRetractAppAsyncTest 00:00:00 Test method OfficeDevPnP.Core.Tests.Sites.ALMTests.DeployRetractAppAsyncTest threw exception: System.IO.FileNotFoundException: Could not load file or assembly 'System.Net.Http, Version=4.2.0.0, Culture=neutral, PublicKeyToken=b03f5f7f11d50a3a' or one of its dependencies. The system cannot find the file specified.WRN: Assembly binding logging is turned OFF. To enable assembly bind failure logging, set the registry value [HKLM\Software\Microsoft\Fusion!EnableLog] (DWORD) to 1. Note: There is some performance penalty associated with assembly bind failure logging. To turn this feature off, remove the registry value [HKLM\Software\Microsoft\Fusion!EnableLog].
OfficeDevPnP.Core.Tests.Sites.ALMTests.DeployRetractAppTest 00:00:00 Test method OfficeDevPnP.Core.Tests.Sites.ALMTests.DeployRetractAppTest threw exception: System.IO.FileNotFoundException: Could not load file or assembly 'System.Net.Http, Version=4.2.0.0, Culture=neutral, PublicKeyToken=b03f5f7f11d50a3a' or one of its dependencies. The system cannot find the file specified.WRN: Assembly binding logging is turned OFF. To enable assembly bind failure logging, set the registry value [HKLM\Software\Microsoft\Fusion!EnableLog] (DWORD) to 1. Note: There is some performance penalty associated with assembly bind failure logging. To turn this feature off, remove the registry value [HKLM\Software\Microsoft\Fusion!EnableLog].
OfficeDevPnP.Core.Tests.Sites.ALMTests.AddCheckRemoveAppTest 00:00:00 Test method OfficeDevPnP.Core.Tests.Sites.ALMTests.AddCheckRemoveAppTest threw exception: System.IO.FileNotFoundException: Could not load file or assembly 'System.Net.Http, Version=4.2.0.0, Culture=neutral, PublicKeyToken=b03f5f7f11d50a3a' or one of its dependencies. The system cannot find the file specified.WRN: Assembly binding logging is turned OFF. To enable assembly bind failure logging, set the registry value [HKLM\Software\Microsoft\Fusion!EnableLog] (DWORD) to 1. Note: There is some performance penalty associated with assembly bind failure logging. To turn this feature off, remove the registry value [HKLM\Software\Microsoft\Fusion!EnableLog].
OfficeDevPnP.Core.Tests.Sites.ALMTests.AddCheckRemoveAppTestAsync 00:00:00 Test method OfficeDevPnP.Core.Tests.Sites.ALMTests.AddCheckRemoveAppTestAsync threw exception: System.IO.FileNotFoundException: Could not load file or assembly 'System.Net.Http, Version=4.2.0.0, Culture=neutral, PublicKeyToken=b03f5f7f11d50a3a' or one of its dependencies. The system cannot find the file specified.WRN: Assembly binding logging is turned OFF. To enable assembly bind failure logging, set the registry value [HKLM\Software\Microsoft\Fusion!EnableLog] (DWORD) to 1. Note: There is some performance penalty associated with assembly bind failure logging. To turn this feature off, remove the registry value [HKLM\Software\Microsoft\Fusion!EnableLog].
OfficeDevPnP.Core.Tests.AppModelExtensions.FileFolderExtensionsTests.EnsureLibraryFolderPathTest 00:00:00 Initialization method OfficeDevPnP.Core.Tests.AppModelExtensions.FileFolderExtensionsTests.Initialize threw exception. Microsoft.SharePoint.Client.ServerUnauthorizedAccessException: Microsoft.SharePoint.Client.ServerUnauthorizedAccessException: Access denied. You do not have permission to perform this action or access this resource..
OfficeDevPnP.Core.Tests.AppModelExtensions.FileFolderExtensionsTests.EnsureLibraryRootFolderPathTest 00:00:00 Initialization method OfficeDevPnP.Core.Tests.AppModelExtensions.FileFolderExtensionsTests.Initialize threw exception. Microsoft.SharePoint.Client.ServerUnauthorizedAccessException: Microsoft.SharePoint.Client.ServerUnauthorizedAccessException: Access denied. You do not have permission to perform this action or access this resource..
OfficeDevPnP.Core.Tests.AppModelExtensions.FileFolderExtensionsTests.EnsureFolderPathTest 00:00:00 Initialization method OfficeDevPnP.Core.Tests.AppModelExtensions.FileFolderExtensionsTests.Initialize threw exception. Microsoft.SharePoint.Client.ServerUnauthorizedAccessException: Microsoft.SharePoint.Client.ServerUnauthorizedAccessException: Access denied. You do not have permission to perform this action or access this resource..
OfficeDevPnP.Core.Tests.AppModelExtensions.FileFolderExtensionsTests.EnsureWebRootFolderPathTest 00:00:00 Initialization method OfficeDevPnP.Core.Tests.AppModelExtensions.FileFolderExtensionsTests.Initialize threw exception. Microsoft.SharePoint.Client.ServerUnauthorizedAccessException: Microsoft.SharePoint.Client.ServerUnauthorizedAccessException: Access denied. You do not have permission to perform this action or access this resource..

Skipped tests
Result Test      Search Duration Error
OfficeDevPnP.Core.Tests.Framework.Providers.XMLProvidersTests.XMLEncryptionTest 00:00:00 Assert.Inconclusive failed. Missing certificate with SN=PnPTestCertificate in CurrentUser Certificate Store, so can't test
OfficeDevPnP.Core.Tests.Framework.Providers.BaseTemplateTests.DumpSingleTemplate N/A
OfficeDevPnP.Core.Tests.Framework.Providers.BaseTemplateTests.DumpBaseTemplates N/A
OfficeDevPnP.Core.Tests.Framework.Providers.BaseTemplateTests.ExtractSingleBaseTemplate2 N/A
OfficeDevPnP.Core.Tests.Framework.Providers.BaseTemplateTests.ExtractBaseTemplates2 N/A
OfficeDevPnP.Core.Tests.Framework.Providers.BaseTemplateTests.ExtractSingleTemplate2 N/A
OfficeDevPnP.Core.Tests.Framework.Providers.BaseTemplateTests.ExtractOtherTemplatesForRelease N/A
OfficeDevPnP.Core.Tests.Framework.Providers.BaseTemplateTests.ExtractMinimalTemplateSetForRelease N/A
OfficeDevPnP.Core.Tests.Utilities.HttpHelperTests.MakePostRequestForStringWithSPContextTest 00:00:00 Assert.Inconclusive failed. No value set for HttpHelperFunctionAppUrl property in the config file
OfficeDevPnP.Core.Tests.Utilities.HttpHelperTests.MakeGetRequestForStringWithSPContextTest 00:00:00 Assert.Inconclusive failed. No value set for HttpHelperFunctionAppUrl property in the config file
Page 1 of 2

Notfound tests
Result Test Duration Error
No data found