Test run details - AzureVMSP2019AppOnly - 11/24/2020 8:26:43 PM

Failed Tests | Skipped Tests | Notfound Tests | Passed Tests

Failed tests
Result Test      Search Duration Error
OfficeDevPnP.Core.Tests.Sites.ALMTests.DeployRetractAppAsyncTest 00:00:00 Test method OfficeDevPnP.Core.Tests.Sites.ALMTests.DeployRetractAppAsyncTest threw exception: System.Exception: {"odata.error":{"code":"-2130575312, Microsoft.SharePoint.SPException","message":{"lang":"en-US","value":"The URL 'AppCatalog/appalmskip-48fa5414-e8cd-43c6-b6bb-417ec296e88a.sppkg' is invalid. It may refer to a nonexistent file or folder, or refer to a valid file or folder that is not in the current Web."}}}
OfficeDevPnP.Core.Tests.Sites.ALMTests.DeployRetractAppTest 00:00:00 Test method OfficeDevPnP.Core.Tests.Sites.ALMTests.DeployRetractAppTest threw exception: System.Exception: {"odata.error":{"code":"-2130575312, Microsoft.SharePoint.SPException","message":{"lang":"en-US","value":"The URL 'AppCatalog/appalmskip-79c21468-f97a-41fd-89cd-df500742330d.sppkg' is invalid. It may refer to a nonexistent file or folder, or refer to a valid file or folder that is not in the current Web."}}}
OfficeDevPnP.Core.Tests.Sites.ALMTests.AddCheckRemoveAppTest 00:00:00 Test method OfficeDevPnP.Core.Tests.Sites.ALMTests.AddCheckRemoveAppTest threw exception: System.Exception: {"odata.error":{"code":"-2130575312, Microsoft.SharePoint.SPException","message":{"lang":"en-US","value":"The URL 'AppCatalog/app-ff75f747-18ad-4647-b92b-d875de0db670.sppkg' is invalid. It may refer to a nonexistent file or folder, or refer to a valid file or folder that is not in the current Web."}}}
OfficeDevPnP.Core.Tests.Sites.ALMTests.AddCheckRemoveAppTestAsync 00:00:00 Test method OfficeDevPnP.Core.Tests.Sites.ALMTests.AddCheckRemoveAppTestAsync threw exception: System.Exception: {"odata.error":{"code":"-2130575312, Microsoft.SharePoint.SPException","message":{"lang":"en-US","value":"The URL 'AppCatalog/app-c86abd8d-d526-45d3-aaa6-36ae1f15bcfe.sppkg' is invalid. It may refer to a nonexistent file or folder, or refer to a valid file or folder that is not in the current Web."}}}
OfficeDevPnP.Core.Tests.AppModelExtensions.PageExtensionsTests.CreatedPublishingPagesSetsTitleCorrectlyTest 00:00:00 Test method OfficeDevPnP.Core.Tests.AppModelExtensions.PageExtensionsTests.CreatedPublishingPagesSetsTitleCorrectlyTest threw exception: Microsoft.SharePoint.Client.ServerException: The Web site address "/sites/pnptest/WebExtensions" is already in use.
OfficeDevPnP.Core.Tests.AppModelExtensions.PageExtensionsTests.CanCreatePublishedPublishingPageWhenModerationIsDisabledTest 00:00:00 Test method OfficeDevPnP.Core.Tests.AppModelExtensions.PageExtensionsTests.CanCreatePublishedPublishingPageWhenModerationIsDisabledTest threw exception: Microsoft.SharePoint.Client.ServerException: The Web site address "/sites/pnptest/WebExtensions" is already in use.
OfficeDevPnP.Core.Tests.AppModelExtensions.PageExtensionsTests.CanCreatePublishedPublishingPageWhenModerationIsEnabledTest 00:00:00 Test method OfficeDevPnP.Core.Tests.AppModelExtensions.PageExtensionsTests.CanCreatePublishedPublishingPageWhenModerationIsEnabledTest threw exception: Microsoft.SharePoint.Client.ServerException: The Web site address "/sites/pnptest/WebExtensions" is already in use.
OfficeDevPnP.Core.Tests.AppModelExtensions.PageExtensionsTests.PublishingPageWithInvalidCharsIsCorrectlyCreatedTest 00:00:00 Test method OfficeDevPnP.Core.Tests.AppModelExtensions.PageExtensionsTests.PublishingPageWithInvalidCharsIsCorrectlyCreatedTest threw exception: Microsoft.SharePoint.Client.ServerException: The Web site address "/sites/pnptest/WebExtensions" is already in use.
OfficeDevPnP.Core.Tests.AppModelExtensions.PageExtensionsTests.CanCreatePublishingPageTest 00:00:00 Test method OfficeDevPnP.Core.Tests.AppModelExtensions.PageExtensionsTests.CanCreatePublishingPageTest threw exception: Microsoft.SharePoint.Client.ServerException: The Web site address "/sites/pnptest/WebExtensions" is already in use.
OfficeDevPnP.Core.Tests.AppModelExtensions.PageExtensionsTests.ProveThatWeCanAddHtmlToPageAfterChangingLayoutTest 00:00:00 Test method OfficeDevPnP.Core.Tests.AppModelExtensions.PageExtensionsTests.ProveThatWeCanAddHtmlToPageAfterChangingLayoutTest threw exception: Microsoft.SharePoint.Client.ServerException: The Web site address "/sites/pnptest/WebExtensions" is already in use.

Skipped tests
Result Test      Search Duration Error
OfficeDevPnP.Core.Tests.Sites.SiteCollectionTests.CreateTeamNoGroupSiteTestAsync 00:00:00 Assert.Inconclusive failed. Test that require modern site collection creation are not supported in app-only.
OfficeDevPnP.Core.Tests.Sites.SiteCollectionTests.CreateCommunicationSiteTestAsync 00:00:00 Assert.Inconclusive failed. Test that require modern site collection creation are not supported in app-only.
OfficeDevPnP.Core.Tests.Authentication.HighTrustAuthenticationTests.CertificateFromStoreAppOnlyAuthenticationTest 00:00:00 Assert.Inconclusive failed. Not enough information to execute this test is passed via the app.config file.
OfficeDevPnP.Core.Tests.Authentication.HighTrustAuthenticationTests.CertificateFileAppOnlyAuthenticationTest 00:00:00 Assert.Inconclusive failed. Not enough information to execute this test is passed via the app.config file.
OfficeDevPnP.Core.Tests.AppModelExtensions.SearchExtensionsTests.TestSiteSearchTest 00:00:00 Assert.Inconclusive failed. Search tests are not supported when testing using app-only
OfficeDevPnP.Core.Tests.AppModelExtensions.SearchExtensionsTests.GetSearchConfigurationFromSiteTest 00:00:00 Assert.Inconclusive failed. Search tests are not supported when testing using app-only
OfficeDevPnP.Core.Tests.AppModelExtensions.SearchExtensionsTests.GetSearchConfigurationFromWebTest 00:00:00 Assert.Inconclusive failed. Search tests are not supported when testing using app-only
OfficeDevPnP.Core.Tests.AppModelExtensions.SearchExtensionsTests.SetSiteCollectionSearchCenterUrlTest 00:00:00 Assert.Inconclusive failed. Search tests are not supported when testing using app-only
OfficeDevPnP.Core.Tests.Framework.CanProvisionRules.CanProvisionTests.CanProvisionHierarchy 00:00:00 Assert.Inconclusive failed. Template requires term store work, so this will not work in app-only
OfficeDevPnP.Core.Tests.Framework.CanProvisionRules.CanProvisionTests.CanProvisionSite 00:00:00 Assert.Inconclusive failed. Template requires term store work, so this will not work in app-only
Page 1 of 9

Notfound tests
Result Test Duration Error
No data found