Test run details - MTFirstReleaseCredentials - 11/20/2020 6:45:06 PM

Failed Tests | Skipped Tests | Notfound Tests | Passed Tests

Failed tests
Result Test      Search Duration Error
OfficeDevPnP.Core.Tests.Sites.ALMTests.DeployRetractAppAsyncTest 00:00:00 Test method OfficeDevPnP.Core.Tests.Sites.ALMTests.DeployRetractAppAsyncTest threw exception: System.IO.FileNotFoundException: Could not load file or assembly 'System.ValueTuple, Version=4.0.2.0, Culture=neutral, PublicKeyToken=cc7b13ffcd2ddd51' or one of its dependencies. The system cannot find the file specified.WRN: Assembly binding logging is turned OFF. To enable assembly bind failure logging, set the registry value [HKLM\Software\Microsoft\Fusion!EnableLog] (DWORD) to 1. Note: There is some performance penalty associated with assembly bind failure logging. To turn this feature off, remove the registry value [HKLM\Software\Microsoft\Fusion!EnableLog].
OfficeDevPnP.Core.Tests.Sites.ALMTests.DeployRetractAppTest 00:00:00 Test method OfficeDevPnP.Core.Tests.Sites.ALMTests.DeployRetractAppTest threw exception: System.IO.FileNotFoundException: Could not load file or assembly 'System.ValueTuple, Version=4.0.2.0, Culture=neutral, PublicKeyToken=cc7b13ffcd2ddd51' or one of its dependencies. The system cannot find the file specified.WRN: Assembly binding logging is turned OFF. To enable assembly bind failure logging, set the registry value [HKLM\Software\Microsoft\Fusion!EnableLog] (DWORD) to 1. Note: There is some performance penalty associated with assembly bind failure logging. To turn this feature off, remove the registry value [HKLM\Software\Microsoft\Fusion!EnableLog].
OfficeDevPnP.Core.Tests.Sites.ALMTests.AddCheckRemoveAppTest 00:00:00 Test method OfficeDevPnP.Core.Tests.Sites.ALMTests.AddCheckRemoveAppTest threw exception: System.IO.FileNotFoundException: Could not load file or assembly 'System.ValueTuple, Version=4.0.2.0, Culture=neutral, PublicKeyToken=cc7b13ffcd2ddd51' or one of its dependencies. The system cannot find the file specified.WRN: Assembly binding logging is turned OFF. To enable assembly bind failure logging, set the registry value [HKLM\Software\Microsoft\Fusion!EnableLog] (DWORD) to 1. Note: There is some performance penalty associated with assembly bind failure logging. To turn this feature off, remove the registry value [HKLM\Software\Microsoft\Fusion!EnableLog].
OfficeDevPnP.Core.Tests.Sites.ALMTests.AddCheckRemoveAppTestAsync 00:00:00 Test method OfficeDevPnP.Core.Tests.Sites.ALMTests.AddCheckRemoveAppTestAsync threw exception: System.IO.FileNotFoundException: Could not load file or assembly 'System.ValueTuple, Version=4.0.2.0, Culture=neutral, PublicKeyToken=cc7b13ffcd2ddd51' or one of its dependencies. The system cannot find the file specified.WRN: Assembly binding logging is turned OFF. To enable assembly bind failure logging, set the registry value [HKLM\Software\Microsoft\Fusion!EnableLog] (DWORD) to 1. Note: There is some performance penalty associated with assembly bind failure logging. To turn this feature off, remove the registry value [HKLM\Software\Microsoft\Fusion!EnableLog].
OfficeDevPnP.Core.Tests.AppModelExtensions.SearchExtensionsTests.TestSiteSearchTest 08:47:13 Test method OfficeDevPnP.Core.Tests.AppModelExtensions.SearchExtensionsTests.TestSiteSearchTest threw exception: System.Reflection.TargetInvocationException: Exception has been thrown by the target of an invocation. ---> System.OutOfMemoryException: Exception of type 'System.OutOfMemoryException' was thrown.
OfficeDevPnP.Core.Tests.Framework.Functional.WorkflowsTests.SiteCollectionWorkflowsTest 00:00:04 Test method OfficeDevPnP.Core.Tests.Framework.Functional.WorkflowsTests.SiteCollectionWorkflowsTest threw exception: System.Exception: Referenced content type 0x0108003365C4474CAE8C42BCE396314E88E51F not available in site or in template
OfficeDevPnP.Core.Tests.Framework.ObjectHandlers.ObjectSiteSecurityTests.CanProvisionAssociatedGroupsInSubSite 00:00:11 Test method OfficeDevPnP.Core.Tests.Framework.ObjectHandlers.ObjectSiteSecurityTests.CanProvisionAssociatedGroupsInSubSite threw exception: System.NullReferenceException: Object reference not set to an instance of an object.
OfficeDevPnP.Core.Tests.Framework.ObjectHandlers.ObjectTeamsTests.CanUpdateObjects 00:00:29 Test method OfficeDevPnP.Core.Tests.Framework.ObjectHandlers.ObjectTeamsTests.CanUpdateObjects threw exception: System.NullReferenceException: Object reference not set to an instance of an object.
OfficeDevPnP.Core.Tests.Framework.Providers.XMLSerializer201903Tests.XMLSerializer_Deserialize_Tenant_SiteDesigns 00:00:00 Assert.AreEqual failed. Expected:<1>. Actual:<68>.
OfficeDevPnP.Core.Tests.Framework.Providers.XMLSerializer201909Tests.XMLSerializer_Deserialize_Tenant_SiteDesigns 00:00:00 Assert.AreEqual failed. Expected:<1>. Actual:<68>.
Page 1 of 2

Skipped tests
Result Test      Search Duration Error
OfficeDevPnP.Core.Tests.Framework.Providers.XMLProvidersTests.XMLEncryptionTest 00:00:00 Assert.Inconclusive failed. Missing certificate with SN=PnPTestCertificate in CurrentUser Certificate Store, so can't test
OfficeDevPnP.Core.Tests.Framework.Providers.BaseTemplateTests.DumpSingleTemplate N/A
OfficeDevPnP.Core.Tests.Framework.Providers.BaseTemplateTests.DumpBaseTemplates N/A
OfficeDevPnP.Core.Tests.Framework.Providers.BaseTemplateTests.ExtractSingleBaseTemplate2 N/A
OfficeDevPnP.Core.Tests.Framework.Providers.BaseTemplateTests.ExtractBaseTemplates2 N/A
OfficeDevPnP.Core.Tests.Framework.Providers.BaseTemplateTests.ExtractSingleTemplate2 N/A
OfficeDevPnP.Core.Tests.Framework.Providers.BaseTemplateTests.ExtractOtherTemplatesForRelease N/A
OfficeDevPnP.Core.Tests.Framework.Providers.BaseTemplateTests.ExtractMinimalTemplateSetForRelease N/A
OfficeDevPnP.Core.Tests.Utilities.HttpHelperTests.MakePostRequestForStringWithSPContextTest 00:00:00 Assert.Inconclusive failed. No value set for HttpHelperFunctionAppUrl property in the config file
OfficeDevPnP.Core.Tests.Utilities.HttpHelperTests.MakeGetRequestForStringWithSPContextTest 00:00:00 Assert.Inconclusive failed. No value set for HttpHelperFunctionAppUrl property in the config file
Page 1 of 3

Notfound tests
Result Test Duration Error
No data found