Test run details - AzureVMSP2019AppOnly - 10/17/2020 8:23:15 PM

Failed Tests | Skipped Tests | Notfound Tests | Passed Tests

Failed tests
Result Test      Search Duration Error
OfficeDevPnP.Core.Tests.Sites.ALMTests.DeployRetractAppAsyncTest 00:00:00 Test method OfficeDevPnP.Core.Tests.Sites.ALMTests.DeployRetractAppAsyncTest threw exception: System.Exception: {"odata.error":{"code":"-2130575312, Microsoft.SharePoint.SPException","message":{"lang":"en-US","value":"The URL 'AppCatalog/appalmskip-2512567f-318a-4d38-8e48-46122e952eac.sppkg' is invalid. It may refer to a nonexistent file or folder, or refer to a valid file or folder that is not in the current Web."}}}
OfficeDevPnP.Core.Tests.Sites.ALMTests.DeployRetractAppTest 00:00:00 Test method OfficeDevPnP.Core.Tests.Sites.ALMTests.DeployRetractAppTest threw exception: System.Exception: {"odata.error":{"code":"-2130575312, Microsoft.SharePoint.SPException","message":{"lang":"en-US","value":"The URL 'AppCatalog/appalmskip-1debac58-b9ae-4456-843f-3be120c97d05.sppkg' is invalid. It may refer to a nonexistent file or folder, or refer to a valid file or folder that is not in the current Web."}}}
OfficeDevPnP.Core.Tests.Sites.ALMTests.AddCheckRemoveAppTest 00:00:00 Test method OfficeDevPnP.Core.Tests.Sites.ALMTests.AddCheckRemoveAppTest threw exception: System.Exception: {"odata.error":{"code":"-2130575312, Microsoft.SharePoint.SPException","message":{"lang":"en-US","value":"The URL 'AppCatalog/app-abcb104a-3daa-4bfd-9ea3-4f3779d72d80.sppkg' is invalid. It may refer to a nonexistent file or folder, or refer to a valid file or folder that is not in the current Web."}}}
OfficeDevPnP.Core.Tests.Sites.ALMTests.AddCheckRemoveAppTestAsync 00:00:00 Test method OfficeDevPnP.Core.Tests.Sites.ALMTests.AddCheckRemoveAppTestAsync threw exception: System.Exception: {"odata.error":{"code":"-2130575312, Microsoft.SharePoint.SPException","message":{"lang":"en-US","value":"The URL 'AppCatalog/app-0f3ba7a5-04a1-496c-bd13-d0ab600ec3f5.sppkg' is invalid. It may refer to a nonexistent file or folder, or refer to a valid file or folder that is not in the current Web."}}}
OfficeDevPnP.Core.Tests.AppModelExtensions.PageExtensionsTests.CreatedPublishingPagesSetsTitleCorrectlyTest 00:00:00 Test method OfficeDevPnP.Core.Tests.AppModelExtensions.PageExtensionsTests.CreatedPublishingPagesSetsTitleCorrectlyTest threw exception: Microsoft.SharePoint.Client.ServerException: The Web site address "/sites/pnptest/WebExtensions" is already in use.
OfficeDevPnP.Core.Tests.AppModelExtensions.PageExtensionsTests.CanCreatePublishedPublishingPageWhenModerationIsDisabledTest 00:00:00 Test method OfficeDevPnP.Core.Tests.AppModelExtensions.PageExtensionsTests.CanCreatePublishedPublishingPageWhenModerationIsDisabledTest threw exception: Microsoft.SharePoint.Client.ServerException: The Web site address "/sites/pnptest/WebExtensions" is already in use.
OfficeDevPnP.Core.Tests.AppModelExtensions.PageExtensionsTests.CanCreatePublishedPublishingPageWhenModerationIsEnabledTest 00:00:00 Test method OfficeDevPnP.Core.Tests.AppModelExtensions.PageExtensionsTests.CanCreatePublishedPublishingPageWhenModerationIsEnabledTest threw exception: Microsoft.SharePoint.Client.ServerException: The Web site address "/sites/pnptest/WebExtensions" is already in use.
OfficeDevPnP.Core.Tests.AppModelExtensions.PageExtensionsTests.PublishingPageWithInvalidCharsIsCorrectlyCreatedTest 00:00:00 Test method OfficeDevPnP.Core.Tests.AppModelExtensions.PageExtensionsTests.PublishingPageWithInvalidCharsIsCorrectlyCreatedTest threw exception: Microsoft.SharePoint.Client.ServerException: The Web site address "/sites/pnptest/WebExtensions" is already in use.
OfficeDevPnP.Core.Tests.AppModelExtensions.PageExtensionsTests.CanCreatePublishingPageTest 00:00:00 Test method OfficeDevPnP.Core.Tests.AppModelExtensions.PageExtensionsTests.CanCreatePublishingPageTest threw exception: Microsoft.SharePoint.Client.ServerException: The Web site address "/sites/pnptest/WebExtensions" is already in use.
OfficeDevPnP.Core.Tests.AppModelExtensions.PageExtensionsTests.ProveThatWeCanAddHtmlToPageAfterChangingLayoutTest 00:00:00 Test method OfficeDevPnP.Core.Tests.AppModelExtensions.PageExtensionsTests.ProveThatWeCanAddHtmlToPageAfterChangingLayoutTest threw exception: Microsoft.SharePoint.Client.ServerException: The Web site address "/sites/pnptest/WebExtensions" is already in use.

Skipped tests
Result Test      Search Duration Error
OfficeDevPnP.Core.Tests.Sites.SiteCollectionTests.CreateTeamNoGroupSiteTestAsync 00:00:00 Assert.Inconclusive failed. Test that require modern site collection creation are not supported in app-only.
OfficeDevPnP.Core.Tests.Sites.SiteCollectionTests.CreateCommunicationSiteTestAsync 00:00:00 Assert.Inconclusive failed. Test that require modern site collection creation are not supported in app-only.
OfficeDevPnP.Core.Tests.Authentication.HighTrustAuthenticationTests.CertificateFromStoreAppOnlyAuthenticationTest 00:00:00 Assert.Inconclusive failed. Not enough information to execute this test is passed via the app.config file.
OfficeDevPnP.Core.Tests.Authentication.HighTrustAuthenticationTests.CertificateFileAppOnlyAuthenticationTest 00:00:00 Assert.Inconclusive failed. Not enough information to execute this test is passed via the app.config file.
OfficeDevPnP.Core.Tests.AppModelExtensions.SearchExtensionsTests.TestSiteSearchTest 00:00:00 Assert.Inconclusive failed. Search tests are not supported when testing using app-only
OfficeDevPnP.Core.Tests.AppModelExtensions.SearchExtensionsTests.GetSearchConfigurationFromSiteTest 00:00:00 Assert.Inconclusive failed. Search tests are not supported when testing using app-only
OfficeDevPnP.Core.Tests.AppModelExtensions.SearchExtensionsTests.GetSearchConfigurationFromWebTest 00:00:00 Assert.Inconclusive failed. Search tests are not supported when testing using app-only
OfficeDevPnP.Core.Tests.AppModelExtensions.SearchExtensionsTests.SetSiteCollectionSearchCenterUrlTest 00:00:00 Assert.Inconclusive failed. Search tests are not supported when testing using app-only
OfficeDevPnP.Core.Tests.Framework.CanProvisionRules.CanProvisionTests.CanProvisionHierarchy 00:00:00 Assert.Inconclusive failed. Template requires term store work, so this will not work in app-only
OfficeDevPnP.Core.Tests.Framework.CanProvisionRules.CanProvisionTests.CanProvisionSite 00:00:00 Assert.Inconclusive failed. Template requires term store work, so this will not work in app-only
Page 1 of 8

Notfound tests
Result Test Duration Error
No data found