Test run details - AzureVMSP2019Credentials - 10/17/2020 6:05:16 PM

Failed Tests | Skipped Tests | Notfound Tests | Passed Tests

Failed tests
Result Test      Search Duration Error
OfficeDevPnP.Core.Tests.Sites.SiteCollectionTests.CreateTeamNoGroupSiteTestAsync 00:00:00 Test method OfficeDevPnP.Core.Tests.Sites.SiteCollectionTests.CreateTeamNoGroupSiteTestAsync threw exception: System.Exception: {"error":{"code":"-1, Microsoft.SharePoint.Client.UnknownError","message":"Unknown Error"}} TestCleanup method OfficeDevPnP.Core.Tests.Sites.SiteCollectionTests.CleanUp threw exception. Microsoft.SharePoint.Client.ServerException: Microsoft.SharePoint.Client.ServerException: File Not Found..
OfficeDevPnP.Core.Tests.Sites.SiteCollectionTests.CreateCommunicationSiteTestAsync 00:00:00 Test method OfficeDevPnP.Core.Tests.Sites.SiteCollectionTests.CreateCommunicationSiteTestAsync threw exception: System.Exception: {"error":{"code":"-1, Microsoft.SharePoint.Client.UnknownError","message":"Unknown Error"}} TestCleanup method OfficeDevPnP.Core.Tests.Sites.SiteCollectionTests.CleanUp threw exception. Microsoft.SharePoint.Client.ServerException: Microsoft.SharePoint.Client.ServerException: File Not Found..
OfficeDevPnP.Core.Tests.Sites.ALMTests.DeployRetractAppAsyncTest 00:00:00 Test method OfficeDevPnP.Core.Tests.Sites.ALMTests.DeployRetractAppAsyncTest threw exception: System.Exception: {"odata.error":{"code":"-2130575312, Microsoft.SharePoint.SPException","message":{"lang":"en-US","value":"The URL 'AppCatalog/appalmskip-f2804dfe-9947-4b0a-bea7-a577874e0608.sppkg' is invalid. It may refer to a nonexistent file or folder, or refer to a valid file or folder that is not in the current Web."}}}
OfficeDevPnP.Core.Tests.Sites.ALMTests.DeployRetractAppTest 00:00:00 Test method OfficeDevPnP.Core.Tests.Sites.ALMTests.DeployRetractAppTest threw exception: System.Exception: {"odata.error":{"code":"-2130575312, Microsoft.SharePoint.SPException","message":{"lang":"en-US","value":"The URL 'AppCatalog/appalmskip-f62393cf-23be-4fe0-8510-35dbde52ea35.sppkg' is invalid. It may refer to a nonexistent file or folder, or refer to a valid file or folder that is not in the current Web."}}}
OfficeDevPnP.Core.Tests.Sites.ALMTests.AddCheckRemoveAppTest 00:00:00 Test method OfficeDevPnP.Core.Tests.Sites.ALMTests.AddCheckRemoveAppTest threw exception: System.Exception: {"odata.error":{"code":"-2130575312, Microsoft.SharePoint.SPException","message":{"lang":"en-US","value":"The URL 'AppCatalog/app-50b2b830-467b-4e8c-b552-321c69c3753e.sppkg' is invalid. It may refer to a nonexistent file or folder, or refer to a valid file or folder that is not in the current Web."}}}
OfficeDevPnP.Core.Tests.Sites.ALMTests.AddCheckRemoveAppTestAsync 00:00:00 Test method OfficeDevPnP.Core.Tests.Sites.ALMTests.AddCheckRemoveAppTestAsync threw exception: System.Exception: {"odata.error":{"code":"-2130575312, Microsoft.SharePoint.SPException","message":{"lang":"en-US","value":"The URL 'AppCatalog/app-d7902f85-327f-4051-aaba-ab0a448e26d5.sppkg' is invalid. It may refer to a nonexistent file or folder, or refer to a valid file or folder that is not in the current Web."}}}
OfficeDevPnP.Core.Tests.AppModelExtensions.PageExtensionsTests.CreatedPublishingPagesSetsTitleCorrectlyTest 00:00:00 Test method OfficeDevPnP.Core.Tests.AppModelExtensions.PageExtensionsTests.CreatedPublishingPagesSetsTitleCorrectlyTest threw exception: Microsoft.SharePoint.Client.ServerException: The Web site address "/sites/pnptest/WebExtensions" is already in use.
OfficeDevPnP.Core.Tests.AppModelExtensions.PageExtensionsTests.CanCreatePublishedPublishingPageWhenModerationIsDisabledTest 00:00:00 Test method OfficeDevPnP.Core.Tests.AppModelExtensions.PageExtensionsTests.CanCreatePublishedPublishingPageWhenModerationIsDisabledTest threw exception: Microsoft.SharePoint.Client.ServerException: The Web site address "/sites/pnptest/WebExtensions" is already in use.
OfficeDevPnP.Core.Tests.AppModelExtensions.PageExtensionsTests.CanCreatePublishedPublishingPageWhenModerationIsEnabledTest 00:00:00 Test method OfficeDevPnP.Core.Tests.AppModelExtensions.PageExtensionsTests.CanCreatePublishedPublishingPageWhenModerationIsEnabledTest threw exception: Microsoft.SharePoint.Client.ServerException: The Web site address "/sites/pnptest/WebExtensions" is already in use.
OfficeDevPnP.Core.Tests.AppModelExtensions.PageExtensionsTests.PublishingPageWithInvalidCharsIsCorrectlyCreatedTest 00:00:00 Test method OfficeDevPnP.Core.Tests.AppModelExtensions.PageExtensionsTests.PublishingPageWithInvalidCharsIsCorrectlyCreatedTest threw exception: Microsoft.SharePoint.Client.ServerException: The Web site address "/sites/pnptest/WebExtensions" is already in use.

Skipped tests
Result Test      Search Duration Error
OfficeDevPnP.Core.Tests.Authentication.HighTrustAuthenticationTests.CertificateFromStoreAppOnlyAuthenticationTest 00:00:00 Assert.Inconclusive failed. Not enough information to execute this test is passed via the app.config file.
OfficeDevPnP.Core.Tests.Authentication.HighTrustAuthenticationTests.CertificateFileAppOnlyAuthenticationTest 00:00:00 Assert.Inconclusive failed. Not enough information to execute this test is passed via the app.config file.
OfficeDevPnP.Core.Tests.Framework.Connectors.ConnectorAzureTests.AzureConnectorBackslashSupportTest 00:00:00 Assert.Inconclusive failed. No Azure Storage Key defined in App.Config, so can't test
OfficeDevPnP.Core.Tests.Framework.Connectors.ConnectorAzureTests.AzureConnectorDelete2FolderTest 00:00:00 Assert.Inconclusive failed. No Azure Storage Key defined in App.Config, so can't test
OfficeDevPnP.Core.Tests.Framework.Connectors.ConnectorAzureTests.AzureConnectorDelete2Test 00:00:00 Assert.Inconclusive failed. No Azure Storage Key defined in App.Config, so can't test
OfficeDevPnP.Core.Tests.Framework.Connectors.ConnectorAzureTests.AzureConnectorDelete1Test 00:00:00 Assert.Inconclusive failed. No Azure Storage Key defined in App.Config, so can't test
OfficeDevPnP.Core.Tests.Framework.Connectors.ConnectorAzureTests.AzureConnectorSaveStream3Test 00:00:00 Assert.Inconclusive failed. No Azure Storage Key defined in App.Config, so can't test
OfficeDevPnP.Core.Tests.Framework.Connectors.ConnectorAzureTests.AzureConnectorSaveStream2Folder2Test 00:00:00 Assert.Inconclusive failed. No Azure Storage Key defined in App.Config, so can't test
OfficeDevPnP.Core.Tests.Framework.Connectors.ConnectorAzureTests.AzureConnectorSaveStream2FolderTest 00:00:00 Assert.Inconclusive failed. No Azure Storage Key defined in App.Config, so can't test
OfficeDevPnP.Core.Tests.Framework.Connectors.ConnectorAzureTests.AzureConnectorSaveStream2Test 00:00:00 Assert.Inconclusive failed. No Azure Storage Key defined in App.Config, so can't test
Page 1 of 4

Notfound tests
Result Test Duration Error
No data found