Test run details - AzureVMSP2019AppOnly - 10/16/2020 8:23:05 PM

Failed Tests | Skipped Tests | Notfound Tests | Passed Tests

Failed tests
Result Test      Search Duration Error
OfficeDevPnP.Core.Tests.Sites.ALMTests.DeployRetractAppAsyncTest 00:00:00 Test method OfficeDevPnP.Core.Tests.Sites.ALMTests.DeployRetractAppAsyncTest threw exception: System.Exception: {"odata.error":{"code":"-2130575312, Microsoft.SharePoint.SPException","message":{"lang":"en-US","value":"The URL 'AppCatalog/appalmskip-192fef11-f888-4f4a-add3-f21debc4d358.sppkg' is invalid. It may refer to a nonexistent file or folder, or refer to a valid file or folder that is not in the current Web."}}}
OfficeDevPnP.Core.Tests.Sites.ALMTests.DeployRetractAppTest 00:00:00 Test method OfficeDevPnP.Core.Tests.Sites.ALMTests.DeployRetractAppTest threw exception: System.Exception: {"odata.error":{"code":"-2130575312, Microsoft.SharePoint.SPException","message":{"lang":"en-US","value":"The URL 'AppCatalog/appalmskip-5aeafe07-0e26-41b4-9597-f6b03bda0eb0.sppkg' is invalid. It may refer to a nonexistent file or folder, or refer to a valid file or folder that is not in the current Web."}}}
OfficeDevPnP.Core.Tests.Sites.ALMTests.AddCheckRemoveAppTest 00:00:00 Test method OfficeDevPnP.Core.Tests.Sites.ALMTests.AddCheckRemoveAppTest threw exception: System.Exception: {"odata.error":{"code":"-2130575312, Microsoft.SharePoint.SPException","message":{"lang":"en-US","value":"The URL 'AppCatalog/app-2d2719d6-ce28-4e6d-a112-009e457f4641.sppkg' is invalid. It may refer to a nonexistent file or folder, or refer to a valid file or folder that is not in the current Web."}}}
OfficeDevPnP.Core.Tests.Sites.ALMTests.AddCheckRemoveAppTestAsync 00:00:00 Test method OfficeDevPnP.Core.Tests.Sites.ALMTests.AddCheckRemoveAppTestAsync threw exception: System.Exception: {"odata.error":{"code":"-2130575312, Microsoft.SharePoint.SPException","message":{"lang":"en-US","value":"The URL 'AppCatalog/app-14d8ac9b-cd00-4ecc-a2a2-107d086ff366.sppkg' is invalid. It may refer to a nonexistent file or folder, or refer to a valid file or folder that is not in the current Web."}}}
OfficeDevPnP.Core.Tests.AppModelExtensions.PageExtensionsTests.CreatedPublishingPagesSetsTitleCorrectlyTest 00:00:00 Test method OfficeDevPnP.Core.Tests.AppModelExtensions.PageExtensionsTests.CreatedPublishingPagesSetsTitleCorrectlyTest threw exception: Microsoft.SharePoint.Client.ServerException: The Web site address "/sites/pnptest/WebExtensions" is already in use.
OfficeDevPnP.Core.Tests.AppModelExtensions.PageExtensionsTests.CanCreatePublishedPublishingPageWhenModerationIsDisabledTest 00:00:00 Test method OfficeDevPnP.Core.Tests.AppModelExtensions.PageExtensionsTests.CanCreatePublishedPublishingPageWhenModerationIsDisabledTest threw exception: Microsoft.SharePoint.Client.ServerException: The Web site address "/sites/pnptest/WebExtensions" is already in use.
OfficeDevPnP.Core.Tests.AppModelExtensions.PageExtensionsTests.CanCreatePublishedPublishingPageWhenModerationIsEnabledTest 00:00:00 Test method OfficeDevPnP.Core.Tests.AppModelExtensions.PageExtensionsTests.CanCreatePublishedPublishingPageWhenModerationIsEnabledTest threw exception: Microsoft.SharePoint.Client.ServerException: The Web site address "/sites/pnptest/WebExtensions" is already in use.
OfficeDevPnP.Core.Tests.AppModelExtensions.PageExtensionsTests.PublishingPageWithInvalidCharsIsCorrectlyCreatedTest 00:00:00 Test method OfficeDevPnP.Core.Tests.AppModelExtensions.PageExtensionsTests.PublishingPageWithInvalidCharsIsCorrectlyCreatedTest threw exception: Microsoft.SharePoint.Client.ServerException: The Web site address "/sites/pnptest/WebExtensions" is already in use.
OfficeDevPnP.Core.Tests.AppModelExtensions.PageExtensionsTests.CanCreatePublishingPageTest 00:00:00 Test method OfficeDevPnP.Core.Tests.AppModelExtensions.PageExtensionsTests.CanCreatePublishingPageTest threw exception: Microsoft.SharePoint.Client.ServerException: The Web site address "/sites/pnptest/WebExtensions" is already in use.
OfficeDevPnP.Core.Tests.AppModelExtensions.PageExtensionsTests.ProveThatWeCanAddHtmlToPageAfterChangingLayoutTest 00:00:00 Test method OfficeDevPnP.Core.Tests.AppModelExtensions.PageExtensionsTests.ProveThatWeCanAddHtmlToPageAfterChangingLayoutTest threw exception: Microsoft.SharePoint.Client.ServerException: The Web site address "/sites/pnptest/WebExtensions" is already in use.

Skipped tests
Result Test      Search Duration Error
OfficeDevPnP.Core.Tests.Sites.SiteCollectionTests.CreateTeamNoGroupSiteTestAsync 00:00:00 Assert.Inconclusive failed. Test that require modern site collection creation are not supported in app-only.
OfficeDevPnP.Core.Tests.Sites.SiteCollectionTests.CreateCommunicationSiteTestAsync 00:00:00 Assert.Inconclusive failed. Test that require modern site collection creation are not supported in app-only.
OfficeDevPnP.Core.Tests.Authentication.HighTrustAuthenticationTests.CertificateFromStoreAppOnlyAuthenticationTest 00:00:00 Assert.Inconclusive failed. Not enough information to execute this test is passed via the app.config file.
OfficeDevPnP.Core.Tests.Authentication.HighTrustAuthenticationTests.CertificateFileAppOnlyAuthenticationTest 00:00:00 Assert.Inconclusive failed. Not enough information to execute this test is passed via the app.config file.
OfficeDevPnP.Core.Tests.AppModelExtensions.SearchExtensionsTests.TestSiteSearchTest 00:00:00 Assert.Inconclusive failed. Search tests are not supported when testing using app-only
OfficeDevPnP.Core.Tests.AppModelExtensions.SearchExtensionsTests.GetSearchConfigurationFromSiteTest 00:00:00 Assert.Inconclusive failed. Search tests are not supported when testing using app-only
OfficeDevPnP.Core.Tests.AppModelExtensions.SearchExtensionsTests.GetSearchConfigurationFromWebTest 00:00:00 Assert.Inconclusive failed. Search tests are not supported when testing using app-only
OfficeDevPnP.Core.Tests.AppModelExtensions.SearchExtensionsTests.SetSiteCollectionSearchCenterUrlTest 00:00:00 Assert.Inconclusive failed. Search tests are not supported when testing using app-only
OfficeDevPnP.Core.Tests.Framework.CanProvisionRules.CanProvisionTests.CanProvisionHierarchy 00:00:00 Assert.Inconclusive failed. Template requires term store work, so this will not work in app-only
OfficeDevPnP.Core.Tests.Framework.CanProvisionRules.CanProvisionTests.CanProvisionSite 00:00:00 Assert.Inconclusive failed. Template requires term store work, so this will not work in app-only
Page 1 of 8

Notfound tests
Result Test Duration Error
No data found