Test run details - MTFirstReleaseCredentials - 6/30/2020 6:45:06 PM

Failed Tests | Skipped Tests | Notfound Tests | Passed Tests

Failed tests
Result Test      Search Duration Error
OfficeDevPnP.Core.Tests.Framework.Functional.WorkflowsNoScriptTests.SiteCollectionWorkflowsTest 00:00:03 Test method OfficeDevPnP.Core.Tests.Framework.Functional.WorkflowsNoScriptTests.SiteCollectionWorkflowsTest threw exception: System.Exception: Referenced content type 0x0108003365C4474CAE8C42BCE396314E88E51F not available in site or in template
OfficeDevPnP.Core.Tests.Framework.Functional.SearchSettingTests.Web1605SearchSettingsTest N/A Class Initialization method OfficeDevPnP.Core.Tests.Framework.Functional.SearchSettingTests.ClassInit threw exception. System.Threading.ThreadAbortException: System.Threading.ThreadAbortException: Thread was being aborted..
OfficeDevPnP.Core.Tests.Framework.Functional.SearchSettingTests.SiteCollection1605SearchSettingsTest N/A Test 'SiteCollection1605SearchSettingsTest' exceeded execution timeout period.
OfficeDevPnP.Core.Tests.Framework.ObjectHandlers.ObjectTermGroupsTests.CanProvisionTokenizedTermsTwiceNameMatch 00:00:01 Test method OfficeDevPnP.Core.Tests.Framework.ObjectHandlers.ObjectTermGroupsTests.CanProvisionTokenizedTermsTwiceNameMatch threw exception: Microsoft.SharePoint.Client.ServerObjectNullReferenceException: Object reference not set to an instance of an object on server. The object is associated with method GetGroup.
OfficeDevPnP.Core.Tests.Framework.ObjectHandlers.ObjectTermGroupsTests.CanProvisionTokenizedTermsTwiceIdMatch 00:00:01 Test method OfficeDevPnP.Core.Tests.Framework.ObjectHandlers.ObjectTermGroupsTests.CanProvisionTokenizedTermsTwiceIdMatch threw exception: Microsoft.SharePoint.Client.ServerObjectNullReferenceException: Object reference not set to an instance of an object on server. The object is associated with method GetGroup.
OfficeDevPnP.Core.Tests.Framework.ObjectHandlers.ObjectTermGroupsTests.CanProvisionReusableTerms 00:00:12 Assert.AreEqual failed. Expected:<2>. Actual:<3>.
OfficeDevPnP.Core.Tests.Framework.ObjectHandlers.ObjectTermGroupsTests.CanProvisionObjects 00:00:01 Test method OfficeDevPnP.Core.Tests.Framework.ObjectHandlers.ObjectTermGroupsTests.CanProvisionObjects threw exception: Microsoft.SharePoint.Client.CollectionNotInitializedException: The collection has not been initialized. It has not been requested or the request has not been executed. It may need to be explicitly requested.
OfficeDevPnP.Core.Tests.Framework.ObjectHandlers.ObjectTeamsTests.CanUpdateObjects 00:00:00 Test method OfficeDevPnP.Core.Tests.Framework.ObjectHandlers.ObjectTeamsTests.CanUpdateObjects threw exception: System.ApplicationException: Exception while invoking endpoint https://graph.microsoft.com/v1.0/groups?$select=id&$filter=mailNickname%20eq%20'unallowedaakkoset'. ---> System.Web.HttpException: { "error": { "code": "InvalidAuthenticationToken", "message": "Access token is empty.", "innerError": { "date": "2020-06-30T19:07:03", "request-id": "f605089d-643a-4519-a270-5520aa8dd6d9" } } } TestCleanup method OfficeDevPnP.Core.Tests.Framework.ObjectHandlers.ObjectTeamsTests.CleanUp threw exception. System.ApplicationException: System.ApplicationException: Exception while invoking endpoint https://graph.microsoft.com/v1.0/groups?$filter=displayName eq 'Sample+Engineering+Team'. ---> System.Web.HttpException: { "error": { "code": "InvalidAuthenticationToken", "message": "Access token is empty.", "innerError": { "date": "2020-06-30T19:07:03", "request-id": "6149b2c9-f030-4fdb-9f20-a97969d14dae" } } }.
OfficeDevPnP.Core.Tests.Framework.ObjectHandlers.ObjectTeamsTests.CanProvisionObjects 00:00:00 Test method OfficeDevPnP.Core.Tests.Framework.ObjectHandlers.ObjectTeamsTests.CanProvisionObjects threw exception: System.ApplicationException: Exception while invoking endpoint https://graph.microsoft.com/v1.0/groups?$select=id&$filter=mailNickname%20eq%20'unallowedaakkoset'. ---> System.Web.HttpException: { "error": { "code": "InvalidAuthenticationToken", "message": "Access token is empty.", "innerError": { "date": "2020-06-30T19:07:02", "request-id": "ec488f3b-e487-493f-866a-806f687824a6" } } } TestCleanup method OfficeDevPnP.Core.Tests.Framework.ObjectHandlers.ObjectTeamsTests.CleanUp threw exception. System.ApplicationException: System.ApplicationException: Exception while invoking endpoint https://graph.microsoft.com/v1.0/groups?$filter=displayName eq 'Sample+Engineering+Team'. ---> System.Web.HttpException: { "error": { "code": "InvalidAuthenticationToken", "message": "Access token is empty.", "innerError": { "date": "2020-06-30T19:07:02", "request-id": "c19630e5-f53a-4529-b1c8-61ee62981812" } } }.
OfficeDevPnP.Core.Tests.Framework.ProvisioningTemplates.ProvisioningTests.ProvisionTenantTemplate 00:00:41 Test method OfficeDevPnP.Core.Tests.Framework.ProvisioningTemplates.ProvisioningTests.ProvisionTenantTemplate threw exception: Microsoft.SharePoint.Client.ServerException: Specified argument was out of the range of valid values. Parameter name: lcid
Page 1 of 1

Skipped tests
Result Test      Search Duration Error
OfficeDevPnP.Core.Tests.Framework.Providers.XMLProvidersTests.XMLEncryptionTest 00:00:00 Assert.Inconclusive failed. Missing certificate with SN=PnPTestCertificate in CurrentUser Certificate Store, so can't test
OfficeDevPnP.Core.Tests.Framework.Providers.BaseTemplateTests.DumpSingleTemplate N/A
OfficeDevPnP.Core.Tests.Framework.Providers.BaseTemplateTests.DumpBaseTemplates N/A
OfficeDevPnP.Core.Tests.Framework.Providers.BaseTemplateTests.ExtractSingleBaseTemplate2 N/A
OfficeDevPnP.Core.Tests.Framework.Providers.BaseTemplateTests.ExtractBaseTemplates2 N/A
OfficeDevPnP.Core.Tests.Framework.Providers.BaseTemplateTests.ExtractSingleTemplate2 N/A
OfficeDevPnP.Core.Tests.Framework.Providers.BaseTemplateTests.ExtractOtherTemplatesForRelease N/A
OfficeDevPnP.Core.Tests.Framework.Providers.BaseTemplateTests.ExtractMinimalTemplateSetForRelease N/A
OfficeDevPnP.Core.Tests.Utilities.HttpHelperTests.MakePostRequestForStringWithSPContextTest 00:00:00 Assert.Inconclusive failed. No value set for HttpHelperFunctionAppUrl property in the config file
OfficeDevPnP.Core.Tests.Utilities.HttpHelperTests.MakeGetRequestForStringWithSPContextTest 00:00:00 Assert.Inconclusive failed. No value set for HttpHelperFunctionAppUrl property in the config file
Page 1 of 3

Notfound tests
Result Test Duration Error
No data found