Test run details - AzureVMSP2019Credentials - 6/30/2020 6:05:10 PM

Failed Tests | Skipped Tests | Notfound Tests | Passed Tests

Failed tests
Result Test      Search Duration Error
OfficeDevPnP.Core.Tests.Framework.CanProvisionRules.CanProvisionTests.CanProvisionSite 00:00:00 Test method OfficeDevPnP.Core.Tests.Framework.CanProvisionRules.CanProvisionTests.CanProvisionSite threw exception: System.NullReferenceException: Object reference not set to an instance of an object.
OfficeDevPnP.Core.Tests.Framework.Functional.WorkflowsTests.WebWorkflowsTest 00:00:30 Test method OfficeDevPnP.Core.Tests.Framework.Functional.WorkflowsTests.WebWorkflowsTest threw exception: Microsoft.SharePoint.Client.ServerException: Cannot invoke method or retrieve property from null object. Object returned by the following call stack is null. "GetWorkflowDeploymentService new Microsoft.SharePoint.WorkflowServices.WorkflowServicesManager() "
OfficeDevPnP.Core.Tests.Framework.Functional.WorkflowsTests.SiteCollectionWorkflowsTest 00:00:31 Test method OfficeDevPnP.Core.Tests.Framework.Functional.WorkflowsTests.SiteCollectionWorkflowsTest threw exception: Microsoft.SharePoint.Client.ServerException: Cannot invoke method or retrieve property from null object. Object returned by the following call stack is null. "GetWorkflowDeploymentService new Microsoft.SharePoint.WorkflowServices.WorkflowServicesManager() "
OfficeDevPnP.Core.Tests.Framework.Functional.WorkflowsNoScriptTests.WebWorkflowsTest 00:00:29 Test method OfficeDevPnP.Core.Tests.Framework.Functional.WorkflowsNoScriptTests.WebWorkflowsTest threw exception: Microsoft.SharePoint.Client.ServerException: Cannot invoke method or retrieve property from null object. Object returned by the following call stack is null. "GetWorkflowDeploymentService new Microsoft.SharePoint.WorkflowServices.WorkflowServicesManager() "
OfficeDevPnP.Core.Tests.Framework.Functional.WorkflowsNoScriptTests.SiteCollectionWorkflowsTest 00:00:31 Test method OfficeDevPnP.Core.Tests.Framework.Functional.WorkflowsNoScriptTests.SiteCollectionWorkflowsTest threw exception: Microsoft.SharePoint.Client.ServerException: Cannot invoke method or retrieve property from null object. Object returned by the following call stack is null. "GetWorkflowDeploymentService new Microsoft.SharePoint.WorkflowServices.WorkflowServicesManager() "
OfficeDevPnP.Core.Tests.Framework.ObjectHandlers.ObjectWorkflowsTests.UpdatWorkflowSubscription 00:00:00 Initialization method OfficeDevPnP.Core.Tests.Framework.ObjectHandlers.ObjectWorkflowsTests.Initialize threw exception. Microsoft.SharePoint.Client.ServerException: Microsoft.SharePoint.Client.ServerException: Cannot invoke method or retrieve property from null object. Object returned by the following call stack is null. "GetWorkflowSubscriptionService new Microsoft.SharePoint.WorkflowServices.WorkflowServicesManager() ".
OfficeDevPnP.Core.Tests.Framework.ObjectHandlers.ObjectTermGroupsTests.CanProvisionTokenizedTermsTwiceNameMatch 00:00:00 Test method OfficeDevPnP.Core.Tests.Framework.ObjectHandlers.ObjectTermGroupsTests.CanProvisionTokenizedTermsTwiceNameMatch threw exception: Microsoft.SharePoint.Client.ServerObjectNullReferenceException: Object reference not set to an instance of an object on server. The object is associated with method GetGroup.
OfficeDevPnP.Core.Tests.Framework.ObjectHandlers.ObjectTermGroupsTests.CanProvisionTokenizedTermsTwiceIdMatch 00:00:00 Test method OfficeDevPnP.Core.Tests.Framework.ObjectHandlers.ObjectTermGroupsTests.CanProvisionTokenizedTermsTwiceIdMatch threw exception: Microsoft.SharePoint.Client.ServerObjectNullReferenceException: Object reference not set to an instance of an object on server. The object is associated with method GetGroup.
Microsoft.SharePoint.Client.Tests.WebExtensionsTests.RemoveAppInstanceByTitleTest 00:00:02 Test method Microsoft.SharePoint.Client.Tests.WebExtensionsTests.RemoveAppInstanceByTitleTest threw exception: Microsoft.SharePoint.Client.ServerException: Sideloading of apps is not enabled on this site.
Microsoft.SharePoint.Client.Tests.WebExtensionsTests.GetAppInstancesTest 00:00:02 Test method Microsoft.SharePoint.Client.Tests.WebExtensionsTests.GetAppInstancesTest threw exception: Microsoft.SharePoint.Client.ServerException: Sideloading of apps is not enabled on this site.
Page 1 of 1

Skipped tests
Result Test      Search Duration Error
OfficeDevPnP.Core.Tests.Authentication.HighTrustAuthenticationTests.CertificateFromStoreAppOnlyAuthenticationTest 00:00:00 Assert.Inconclusive failed. Not enough information to execute this test is passed via the app.config file.
OfficeDevPnP.Core.Tests.Authentication.HighTrustAuthenticationTests.CertificateFileAppOnlyAuthenticationTest 00:00:00 Assert.Inconclusive failed. Not enough information to execute this test is passed via the app.config file.
OfficeDevPnP.Core.Tests.Framework.Connectors.ConnectorAzureTests.AzureConnectorBackslashSupportTest 00:00:00 Assert.Inconclusive failed. No Azure Storage Key defined in App.Config, so can't test
OfficeDevPnP.Core.Tests.Framework.Connectors.ConnectorAzureTests.AzureConnectorDelete2FolderTest 00:00:00 Assert.Inconclusive failed. No Azure Storage Key defined in App.Config, so can't test
OfficeDevPnP.Core.Tests.Framework.Connectors.ConnectorAzureTests.AzureConnectorDelete2Test 00:00:00 Assert.Inconclusive failed. No Azure Storage Key defined in App.Config, so can't test
OfficeDevPnP.Core.Tests.Framework.Connectors.ConnectorAzureTests.AzureConnectorDelete1Test 00:00:00 Assert.Inconclusive failed. No Azure Storage Key defined in App.Config, so can't test
OfficeDevPnP.Core.Tests.Framework.Connectors.ConnectorAzureTests.AzureConnectorSaveStream3Test 00:00:00 Assert.Inconclusive failed. No Azure Storage Key defined in App.Config, so can't test
OfficeDevPnP.Core.Tests.Framework.Connectors.ConnectorAzureTests.AzureConnectorSaveStream2Folder2Test 00:00:00 Assert.Inconclusive failed. No Azure Storage Key defined in App.Config, so can't test
OfficeDevPnP.Core.Tests.Framework.Connectors.ConnectorAzureTests.AzureConnectorSaveStream2FolderTest 00:00:00 Assert.Inconclusive failed. No Azure Storage Key defined in App.Config, so can't test
OfficeDevPnP.Core.Tests.Framework.Connectors.ConnectorAzureTests.AzureConnectorSaveStream2Test 00:00:00 Assert.Inconclusive failed. No Azure Storage Key defined in App.Config, so can't test
Page 1 of 5

Notfound tests
Result Test Duration Error
No data found