Test run details - MTFirstReleaseCredentials - 6/28/2020 6:45:07 PM

Failed Tests | Skipped Tests | Notfound Tests | Passed Tests

Failed tests
Result Test      Search Duration Error
OfficeDevPnP.Core.Tests.Authentication.AuthenticationTests.AzureADAuthFullControlPermissionTest 00:00:00 Test method OfficeDevPnP.Core.Tests.Authentication.AuthenticationTests.AzureADAuthFullControlPermissionTest threw exception: Microsoft.IdentityModel.Clients.ActiveDirectory.AdalServiceException: AADSTS700027: Client assertion contains an invalid signature. [Reason - The key used is expired., Thumbprint of key used by client: 'F6AF5FBB5F8CD2ABBDC9586CC15908AE55AED09F', Found key 'Start=03/01/2016 00:00:00, End=03/01/2020 00:00:00', Please visit 'https://developer.microsoft.com/en-us/graph/graph-explorer' and query for 'https://graph.microsoft.com/beta/applications/cd2433f1-6c22-4d29-bb52-a349def0afbd' to see configured keys] Trace ID: a9845807-c5bd-4402-b3e1-0d3c9ac91e03 Correlation ID: 98a2d8c4-ce9c-453c-9cd4-f2b5299b9650 Timestamp: 2020-06-28 23:16:37Z ---> System.Net.Http.HttpRequestException: Response status code does not indicate success: 401 (Unauthorized). ---> Microsoft.IdentityModel.Clients.ActiveDirectory.AdalException: {"error":"invalid_client","error_description":"AADSTS700027: Client assertion contains an invalid signature. [Reason - The key used is expired., Thumbprint of key used by client: 'F6AF5FBB5F8CD2ABBDC9586CC15908AE55AED09F', Found key 'Start=03/01/2016 00:00:00, End=03/01/2020 00:00:00', Please visit 'https://developer.microsoft.com/en-us/graph/graph-explorer' and query for 'https://graph.microsoft.com/beta/applications/cd2433f1-6c22-4d29-bb52-a349def0afbd' to see configured keys]\r\nTrace ID: a9845807-c5bd-4402-b3e1-0d3c9ac91e03\r\nCorrelation ID: 98a2d8c4-ce9c-453c-9cd4-f2b5299b9650\r\nTimestamp: 2020-06-28 23:16:37Z","error_codes":[700027],"timestamp":"2020-06-28 23:16:37Z","trace_id":"a9845807-c5bd-4402-b3e1-0d3c9ac91e03","correlation_id":"98a2d8c4-ce9c-453c-9cd4-f2b5299b9650","error_uri":"https://login.microsoftonline.com/error?code=700027"}: Unknown error
OfficeDevPnP.Core.Tests.AppModelExtensions.NavigationExtensionsTests.DeleteTopNavigationNodeTest 00:00:00 Test method OfficeDevPnP.Core.Tests.AppModelExtensions.NavigationExtensionsTests.DeleteTopNavigationNodeTest threw exception: System.InvalidOperationException: Sequence contains more than one matching element
OfficeDevPnP.Core.Tests.Framework.Functional.PublishingTest.SiteCollectionPublishingTest N/A Test 'SiteCollectionPublishingTest' exceeded execution timeout period.
OfficeDevPnP.Core.Tests.Framework.ObjectHandlers.TokenParserTests.ParseTests 00:00:02 Test method OfficeDevPnP.Core.Tests.Framework.ObjectHandlers.TokenParserTests.ParseTests threw exception: Microsoft.SharePoint.Client.ServerObjectNullReferenceException: Object reference not set to an instance of an object on server. The object is associated with property AssociatedMemberGroup.
OfficeDevPnP.Core.Tests.Framework.ObjectHandlers.ObjectFilesTests.CanProvisionObjects 00:00:01 Test method OfficeDevPnP.Core.Tests.Framework.ObjectHandlers.ObjectFilesTests.CanProvisionObjects threw exception: Microsoft.SharePoint.Client.ServerException: The object specified does not belong to a list.
OfficeDevPnP.Core.Tests.Framework.ObjectHandlers.ObjectSiteSecurityTests.CanCreateNewAssociatedGroupsInNewScriptSite_BeforeAsyncRename 00:05:15 Assert.Fail failed. Waiting for async group title change timed out. Try increasing the maxWaitMs.
OfficeDevPnP.Core.Tests.Framework.ObjectHandlers.ObjectSiteSecurityTests.CanProvisionNewAssociatedGroup 00:00:02 Assert.IsTrue failed.
OfficeDevPnP.Core.Tests.Framework.ObjectHandlers.ObjectSiteSecurityTests.CanProvisionAssociatedGroups 00:00:04 Assert.AreEqual failed. Expected:<Test_Member Group_637289686838390756>. Actual:<(null)>.
OfficeDevPnP.Core.Tests.Framework.ObjectHandlers.ObjectSiteSecurityTests.CanCreateEntities2 00:00:02 Test method OfficeDevPnP.Core.Tests.Framework.ObjectHandlers.ObjectSiteSecurityTests.CanCreateEntities2 threw exception: System.NullReferenceException: Object reference not set to an instance of an object.
OfficeDevPnP.Core.Tests.Framework.ObjectHandlers.ObjectSiteSecurityTests.CanProvisionObjects 00:00:02 Test method OfficeDevPnP.Core.Tests.Framework.ObjectHandlers.ObjectSiteSecurityTests.CanProvisionObjects threw exception: Microsoft.SharePoint.Client.ServerException: Cannot invoke method or retrieve property from null object. Object returned by the following call stack is null. "AssociatedMemberGroup "
Page 1 of 3

Skipped tests
Result Test      Search Duration Error
OfficeDevPnP.Core.Tests.Framework.Providers.XMLProvidersTests.XMLEncryptionTest 00:00:00 Assert.Inconclusive failed. Missing certificate with SN=PnPTestCertificate in CurrentUser Certificate Store, so can't test
OfficeDevPnP.Core.Tests.Framework.Providers.BaseTemplateTests.DumpSingleTemplate N/A
OfficeDevPnP.Core.Tests.Framework.Providers.BaseTemplateTests.DumpBaseTemplates N/A
OfficeDevPnP.Core.Tests.Framework.Providers.BaseTemplateTests.ExtractSingleBaseTemplate2 N/A
OfficeDevPnP.Core.Tests.Framework.Providers.BaseTemplateTests.ExtractBaseTemplates2 N/A
OfficeDevPnP.Core.Tests.Framework.Providers.BaseTemplateTests.ExtractSingleTemplate2 N/A
OfficeDevPnP.Core.Tests.Framework.Providers.BaseTemplateTests.ExtractOtherTemplatesForRelease N/A
OfficeDevPnP.Core.Tests.Framework.Providers.BaseTemplateTests.ExtractMinimalTemplateSetForRelease N/A
OfficeDevPnP.Core.Tests.Utilities.HttpHelperTests.MakePostRequestForStringWithSPContextTest 00:00:00 Assert.Inconclusive failed. No value set for HttpHelperFunctionAppUrl property in the config file
OfficeDevPnP.Core.Tests.Utilities.HttpHelperTests.MakeGetRequestForStringWithSPContextTest 00:00:00 Assert.Inconclusive failed. No value set for HttpHelperFunctionAppUrl property in the config file
Page 1 of 3

Notfound tests
Result Test Duration Error
No data found