Test run details - MTFirstReleaseCredentials - 3/24/2020 6:45:12 PM

Failed Tests | Skipped Tests | Notfound Tests | Passed Tests

Failed tests
Result Test      Search Duration Error
OfficeDevPnP.Core.Tests.Sites.SiteCollectionTests.CreateTeamNoGroupSiteTestAsync 00:03:15 TestCleanup method OfficeDevPnP.Core.Tests.Sites.SiteCollectionTests.CleanUp threw exception. Microsoft.SharePoint.Client.ServerException: Microsoft.SharePoint.Client.ServerException: File Not Found..
OfficeDevPnP.Core.Tests.Sites.ALMTests.DeployRetractAppAsyncTest 00:00:12 Test method OfficeDevPnP.Core.Tests.Sites.ALMTests.DeployRetractAppAsyncTest threw exception: System.InvalidOperationException: The request message was already sent. Cannot send the same request message multiple times.
OfficeDevPnP.Core.Tests.Sites.ALMTests.DeployRetractAppTest 00:00:11 Test method OfficeDevPnP.Core.Tests.Sites.ALMTests.DeployRetractAppTest threw exception: System.InvalidOperationException: The request message was already sent. Cannot send the same request message multiple times.
OfficeDevPnP.Core.Tests.Sites.ALMTests.AddCheckRemoveAppTest 00:00:11 Test method OfficeDevPnP.Core.Tests.Sites.ALMTests.AddCheckRemoveAppTest threw exception: System.InvalidOperationException: The request message was already sent. Cannot send the same request message multiple times.
OfficeDevPnP.Core.Tests.Sites.ALMTests.AddCheckRemoveAppTestAsync 00:00:12 Test method OfficeDevPnP.Core.Tests.Sites.ALMTests.AddCheckRemoveAppTestAsync threw exception: System.InvalidOperationException: The request message was already sent. Cannot send the same request message multiple times.
OfficeDevPnP.Core.Tests.Authentication.AuthenticationTests.AzureADAuthFullControlPermissionTest 00:00:01 Test method OfficeDevPnP.Core.Tests.Authentication.AuthenticationTests.AzureADAuthFullControlPermissionTest threw exception: Microsoft.IdentityModel.Clients.ActiveDirectory.AdalServiceException: AADSTS700027: Client assertion contains an invalid signature. [Reason - The key used is expired., Thumbprint of key used by client: 'F6AF5FBB5F8CD2ABBDC9586CC15908AE55AED09F', Found key 'Start=03/01/2016 00:00:00, End=03/01/2020 00:00:00', Please visit 'https://developer.microsoft.com/en-us/graph/graph-explorer' and query for 'https://graph.microsoft.com/beta/applications/cd2433f1-6c22-4d29-bb52-a349def0afbd' to see configured keys] Trace ID: 4710a730-5395-42c0-92b9-e7ad28043900 Correlation ID: a0ddfdac-f54a-4a65-97b7-c85960a50806 Timestamp: 2020-03-25 07:27:05Z ---> System.Net.Http.HttpRequestException: Response status code does not indicate success: 401 (Unauthorized). ---> Microsoft.IdentityModel.Clients.ActiveDirectory.AdalException: {"error":"invalid_client","error_description":"AADSTS700027: Client assertion contains an invalid signature. [Reason - The key used is expired., Thumbprint of key used by client: 'F6AF5FBB5F8CD2ABBDC9586CC15908AE55AED09F', Found key 'Start=03/01/2016 00:00:00, End=03/01/2020 00:00:00', Please visit 'https://developer.microsoft.com/en-us/graph/graph-explorer' and query for 'https://graph.microsoft.com/beta/applications/cd2433f1-6c22-4d29-bb52-a349def0afbd' to see configured keys]\r\nTrace ID: 4710a730-5395-42c0-92b9-e7ad28043900\r\nCorrelation ID: a0ddfdac-f54a-4a65-97b7-c85960a50806\r\nTimestamp: 2020-03-25 07:27:05Z","error_codes":[700027],"timestamp":"2020-03-25 07:27:05Z","trace_id":"4710a730-5395-42c0-92b9-e7ad28043900","correlation_id":"a0ddfdac-f54a-4a65-97b7-c85960a50806","error_uri":"https://login.microsoftonline.com/error?code=700027"}: Unknown error
OfficeDevPnP.Core.Tests.AppModelExtensions.NavigationExtensionsTests.DeleteTopNavigationNodeTest 00:00:00 Test method OfficeDevPnP.Core.Tests.AppModelExtensions.NavigationExtensionsTests.DeleteTopNavigationNodeTest threw exception: System.InvalidOperationException: Sequence contains more than one matching element
OfficeDevPnP.Core.Tests.AppModelExtensions.TenantExtensionsTests.SubSiteExistsTest 00:15:00 Test 'SubSiteExistsTest' exceeded execution timeout period.
OfficeDevPnP.Core.Tests.Framework.Functional.WorkflowsTests.SiteCollectionWorkflowsTest 00:00:04 Test method OfficeDevPnP.Core.Tests.Framework.Functional.WorkflowsTests.SiteCollectionWorkflowsTest threw exception: System.Exception: Referenced content type 0x0108003365C4474CAE8C42BCE396314E88E51F not available in site or in template
OfficeDevPnP.Core.Tests.Framework.Functional.WorkflowsNoScriptTests.WebWorkflowsTest N/A Class Initialization method OfficeDevPnP.Core.Tests.Framework.Functional.WorkflowsNoScriptTests.ClassInit threw exception. System.Threading.ThreadAbortException: System.Threading.ThreadAbortException: Thread was being aborted..
Page 1 of 9

Notfound tests
Result Test Duration Error
No data found