Test run details - AzureVMSP2016Credentials - 3/24/2020 6:00:07 PM

Failed Tests | Skipped Tests | Notfound Tests | Passed Tests

Failed tests
Result Test      Search Duration Error
OfficeDevPnP.Core.Tests.AppModelExtensions.Tenant15ExtensionsTests.CreateDeleteSiteCollectionTest 00:00:00 Test method OfficeDevPnP.Core.Tests.AppModelExtensions.Tenant15ExtensionsTests.CreateDeleteSiteCollectionTest threw exception: Microsoft.SharePoint.Client.ServerException: Another site already exists at https://portal2016.pnp.com/sites/TestPnPSC_123456789. Delete this site before attempting to create a new site with the same URL, choose a new URL, or create a new inclusion at the path you originally specified.
OfficeDevPnP.Core.Tests.Framework.ObjectHandlers.ObjectWorkflowsTests.UpdatWorkflowSubscription 00:00:00 Test method OfficeDevPnP.Core.Tests.Framework.ObjectHandlers.ObjectWorkflowsTests.UpdatWorkflowSubscription threw exception: Microsoft.SharePoint.Client.ServerException: Cannot invoke method or retrieve property from null object. Object returned by the following call stack is null. "GetWorkflowDeploymentService new Microsoft.SharePoint.WorkflowServices.WorkflowServicesManager() "
OfficeDevPnP.Core.Tests.Framework.ObjectHandlers.ObjectSiteSecurityTests.CanProvisionNewAssociatedGroup 00:00:00 Assert.IsTrue failed.
OfficeDevPnP.Core.Tests.Framework.ObjectHandlers.ObjectSiteSecurityTests.CanProvisionAssociatedGroups 00:00:01 Assert.IsNotNull failed.
OfficeDevPnP.Core.Tests.Framework.ObjectHandlers.ObjectSiteSecurityTests.CanCreateEntities2 00:00:01 Assert.IsFalse failed.
OfficeDevPnP.Core.Tests.Framework.ObjectHandlers.ObjectTermGroupsTests.CanProvisionTokenizedTermsTwiceNameMatch 00:00:00 Test method OfficeDevPnP.Core.Tests.Framework.ObjectHandlers.ObjectTermGroupsTests.CanProvisionTokenizedTermsTwiceNameMatch threw exception: Microsoft.SharePoint.Client.ServerObjectNullReferenceException: Object reference not set to an instance of an object on server. The object is associated with method GetGroup.
OfficeDevPnP.Core.Tests.Framework.ObjectHandlers.ObjectTermGroupsTests.CanProvisionTokenizedTermsTwiceIdMatch 00:00:00 Test method OfficeDevPnP.Core.Tests.Framework.ObjectHandlers.ObjectTermGroupsTests.CanProvisionTokenizedTermsTwiceIdMatch threw exception: Microsoft.SharePoint.Client.ServerObjectNullReferenceException: Object reference not set to an instance of an object on server. The object is associated with method GetGroup.
OfficeDevPnP.Core.Tests.Utilities.HttpHelperTests.MakePostRequestForStringWithSPContextTest 00:00:00 Test method OfficeDevPnP.Core.Tests.Utilities.HttpHelperTests.MakePostRequestForStringWithSPContextTest threw exception: System.ApplicationException: Exception while invoking endpoint https://portal2016.pnp.com/sites/pnptest/_api/web. ---> System.Web.HttpException: 401 UNAUTHORIZED
OfficeDevPnP.Core.Tests.Utilities.HttpHelperTests.MakeGetRequestForStringWithSPContextTest 00:00:05 Test method OfficeDevPnP.Core.Tests.Utilities.HttpHelperTests.MakeGetRequestForStringWithSPContextTest threw exception: System.ApplicationException: Exception while invoking endpoint https://portal2016.pnp.com/sites/pnptest/_api/web. ---> System.Web.HttpException: 401 UNAUTHORIZED
OfficeDevPnP.Core.Tests.Utilities.HttpHelperTests.MakeDeleteRequestTest 00:00:00 Test method OfficeDevPnP.Core.Tests.Utilities.HttpHelperTests.MakeDeleteRequestTest threw exception: System.UriFormatException: Invalid URI: The format of the URI could not be determined.
Page 1 of 2

Skipped tests
Result Test      Search Duration Error
OfficeDevPnP.Core.Tests.Authentication.HighTrustAuthenticationTests.CertificateFromStoreAppOnlyAuthenticationTest 00:00:00 Assert.Inconclusive failed. Not enough information to execute this test is passed via the app.config file.
OfficeDevPnP.Core.Tests.Authentication.HighTrustAuthenticationTests.CertificateFileAppOnlyAuthenticationTest 00:00:00 Assert.Inconclusive failed. Not enough information to execute this test is passed via the app.config file.
OfficeDevPnP.Core.Tests.Framework.Connectors.ConnectorAzureTests.AzureConnectorBackslashSupportTest 00:00:00 Assert.Inconclusive failed. No Azure Storage Key defined in App.Config, so can't test
OfficeDevPnP.Core.Tests.Framework.Connectors.ConnectorAzureTests.AzureConnectorDelete2FolderTest 00:00:00 Assert.Inconclusive failed. No Azure Storage Key defined in App.Config, so can't test
OfficeDevPnP.Core.Tests.Framework.Connectors.ConnectorAzureTests.AzureConnectorDelete2Test 00:00:00 Assert.Inconclusive failed. No Azure Storage Key defined in App.Config, so can't test
OfficeDevPnP.Core.Tests.Framework.Connectors.ConnectorAzureTests.AzureConnectorDelete1Test 00:00:00 Assert.Inconclusive failed. No Azure Storage Key defined in App.Config, so can't test
OfficeDevPnP.Core.Tests.Framework.Connectors.ConnectorAzureTests.AzureConnectorSaveStream3Test 00:00:00 Assert.Inconclusive failed. No Azure Storage Key defined in App.Config, so can't test
OfficeDevPnP.Core.Tests.Framework.Connectors.ConnectorAzureTests.AzureConnectorSaveStream2Folder2Test 00:00:00 Assert.Inconclusive failed. No Azure Storage Key defined in App.Config, so can't test
OfficeDevPnP.Core.Tests.Framework.Connectors.ConnectorAzureTests.AzureConnectorSaveStream2FolderTest 00:00:00 Assert.Inconclusive failed. No Azure Storage Key defined in App.Config, so can't test
OfficeDevPnP.Core.Tests.Framework.Connectors.ConnectorAzureTests.AzureConnectorSaveStream2Test 00:00:00 Assert.Inconclusive failed. No Azure Storage Key defined in App.Config, so can't test
Page 1 of 3

Notfound tests
Result Test Duration Error
No data found