Test run details - MTFirstReleaseCredentials - 1/13/2020 6:45:08 PM

Failed Tests | Skipped Tests | Notfound Tests | Passed Tests

Failed tests
Result Test      Search Duration Error
OfficeDevPnP.Core.Tests.Sites.SiteCollectionTests.CreateTeamNoGroupSiteTestAsync 00:03:47 TestCleanup method OfficeDevPnP.Core.Tests.Sites.SiteCollectionTests.CleanUp threw exception. Microsoft.SharePoint.Client.ServerException: Microsoft.SharePoint.Client.ServerException: File Not Found..
OfficeDevPnP.Core.Tests.Sites.ALMTests.DeployRetractAppAsyncTest 00:00:11 Test method OfficeDevPnP.Core.Tests.Sites.ALMTests.DeployRetractAppAsyncTest threw exception: System.InvalidOperationException: The request message was already sent. Cannot send the same request message multiple times.
OfficeDevPnP.Core.Tests.Sites.ALMTests.DeployRetractAppTest 00:00:12 Test method OfficeDevPnP.Core.Tests.Sites.ALMTests.DeployRetractAppTest threw exception: System.InvalidOperationException: The request message was already sent. Cannot send the same request message multiple times.
OfficeDevPnP.Core.Tests.AppModelExtensions.NavigationExtensionsTests.DeleteTopNavigationNodeTest 00:00:00 Test method OfficeDevPnP.Core.Tests.AppModelExtensions.NavigationExtensionsTests.DeleteTopNavigationNodeTest threw exception: System.InvalidOperationException: Sequence contains more than one matching element
OfficeDevPnP.Core.Tests.Framework.Functional.WorkflowsTests.SiteCollectionWorkflowsTest 00:00:04 Test method OfficeDevPnP.Core.Tests.Framework.Functional.WorkflowsTests.SiteCollectionWorkflowsTest threw exception: System.Exception: Referenced content type 0x0108003365C4474CAE8C42BCE396314E88E51F not available in site or in template
OfficeDevPnP.Core.Tests.Framework.Functional.LanguageTests.WebLanguageSettingsTest N/A Class Initialization method OfficeDevPnP.Core.Tests.Framework.Functional.LanguageTests.ClassInit threw exception. System.Threading.ThreadAbortException: System.Threading.ThreadAbortException: Thread was being aborted..
OfficeDevPnP.Core.Tests.Framework.Functional.LanguageTests.SiteCollectionLanguageSettingsTest N/A Test 'SiteCollectionLanguageSettingsTest' exceeded execution timeout period.
OfficeDevPnP.Core.Tests.Framework.Functional.LocalizationTest.WebLocalizationTest 00:00:43 Assert.IsTrue failed.
OfficeDevPnP.Core.Tests.Framework.Functional.FilesNoScriptTests.WebCollectionDirectoryFilesTest N/A Class Initialization method OfficeDevPnP.Core.Tests.Framework.Functional.FilesNoScriptTests.ClassInit threw exception. System.Threading.ThreadAbortException: System.Threading.ThreadAbortException: Thread was being aborted..
OfficeDevPnP.Core.Tests.Framework.Functional.FilesNoScriptTests.WebFilesTest N/A Class Initialization method OfficeDevPnP.Core.Tests.Framework.Functional.FilesNoScriptTests.ClassInit threw exception. System.Threading.ThreadAbortException: System.Threading.ThreadAbortException: Thread was being aborted..
Page 1 of 4

Notfound tests
Result Test Duration Error
No data found