Test run details - AzureVMSP2016AppOnly - 12/2/2019 7:23:15 PM

Failed Tests | Skipped Tests | Notfound Tests | Passed Tests

Failed tests
Result Test      Search Duration Error
OfficeDevPnP.Core.Tests.AppModelExtensions.Tenant15ExtensionsTests.CreateDeleteSiteCollectionTest 00:00:00 Test method OfficeDevPnP.Core.Tests.AppModelExtensions.Tenant15ExtensionsTests.CreateDeleteSiteCollectionTest threw exception: Microsoft.SharePoint.Client.ServerException: Another site already exists at https://portal2016.pnp.com/sites/TestPnPSC_123456789. Delete this site before attempting to create a new site with the same URL, choose a new URL, or create a new inclusion at the path you originally specified.
OfficeDevPnP.Core.Tests.Framework.Functional.ContentTypeTests.SiteCollectionContentTypeAddingTest 00:00:18 Test method OfficeDevPnP.Core.Tests.Framework.Functional.ContentTypeTests.SiteCollectionContentTypeAddingTest threw exception: Microsoft.SharePoint.Client.ServerException: The content type "CT_10" at "/sites/TestPnPSC_12345_2ecf9cbc-4496-4a7e-82db-92ee1e51539e" is read only.
OfficeDevPnP.Core.Tests.Framework.ObjectHandlers.ObjectWorkflowsTests.UpdatWorkflowSubscription 00:00:00 Test method OfficeDevPnP.Core.Tests.Framework.ObjectHandlers.ObjectWorkflowsTests.UpdatWorkflowSubscription threw exception: Microsoft.SharePoint.Client.ServerException: Cannot invoke method or retrieve property from null object. Object returned by the following call stack is null. "GetWorkflowDeploymentService new Microsoft.SharePoint.WorkflowServices.WorkflowServicesManager() "
OfficeDevPnP.Core.Tests.Framework.ObjectHandlers.ObjectSiteSecurityTests.CanProvisionNewAssociatedGroup 00:00:01 Assert.IsTrue failed.
OfficeDevPnP.Core.Tests.Framework.ObjectHandlers.ObjectSiteSecurityTests.CanProvisionAssociatedGroups 00:00:01 Assert.IsNotNull failed.
OfficeDevPnP.Core.Tests.Framework.ObjectHandlers.ObjectSiteSecurityTests.CanCreateEntities2 00:00:01 Assert.IsFalse failed.
Microsoft.SharePoint.Client.Tests.FieldAndContentTypeExtensionsTests.ThrowsArgumentOutOfRangeExceptionWhenSettingDefaultContentThatDoesNotExistInList 00:00:04 Assert.AreEqual failed. Expected:<0x0101>. Actual:<0x010100CEE26C745745E44DA8AFCD1EC13D5381>.
Page 1 of 1

Skipped tests
Result Test      Search Duration Error
OfficeDevPnP.Core.Tests.Authentication.HighTrustAuthenticationTests.CertificateFromStoreAppOnlyAuthenticationTest 00:00:00 Assert.Inconclusive failed. Not enough information to execute this test is passed via the app.config file.
OfficeDevPnP.Core.Tests.Authentication.HighTrustAuthenticationTests.CertificateFileAppOnlyAuthenticationTest 00:00:00 Assert.Inconclusive failed. Not enough information to execute this test is passed via the app.config file.
OfficeDevPnP.Core.Tests.AppModelExtensions.FileFolderExtensionsTests.UploadFileWebDavTest 00:00:01 Assert.Inconclusive failed. Tests involving webdav are not supported when testing using app-only
OfficeDevPnP.Core.Tests.AppModelExtensions.SearchExtensionsTests.TestSiteSearchTest 00:00:00 Assert.Inconclusive failed. Search tests are not supported when testing using app-only
OfficeDevPnP.Core.Tests.AppModelExtensions.SearchExtensionsTests.GetSearchConfigurationFromSiteTest 00:00:00 Assert.Inconclusive failed. Search tests are not supported when testing using app-only
OfficeDevPnP.Core.Tests.AppModelExtensions.SearchExtensionsTests.GetSearchConfigurationFromWebTest 00:00:00 Assert.Inconclusive failed. Search tests are not supported when testing using app-only
OfficeDevPnP.Core.Tests.AppModelExtensions.SearchExtensionsTests.SetSiteCollectionSearchCenterUrlTest 00:00:00 Assert.Inconclusive failed. Search tests are not supported when testing using app-only
OfficeDevPnP.Core.Tests.Framework.Connectors.ConnectorAzureTests.AzureConnectorBackslashSupportTest 00:00:00 Assert.Inconclusive failed. No Azure Storage Key defined in App.Config, so can't test
OfficeDevPnP.Core.Tests.Framework.Connectors.ConnectorAzureTests.AzureConnectorDelete2FolderTest 00:00:00 Assert.Inconclusive failed. No Azure Storage Key defined in App.Config, so can't test
OfficeDevPnP.Core.Tests.Framework.Connectors.ConnectorAzureTests.AzureConnectorDelete2Test 00:00:00 Assert.Inconclusive failed. No Azure Storage Key defined in App.Config, so can't test
Page 1 of 8

Notfound tests
Result Test Duration Error
No data found