Test run details - MTFirstReleaseCredentials - 12/2/2019 6:45:08 PM

Failed Tests | Skipped Tests | Notfound Tests | Passed Tests

Failed tests
Result Test      Search Duration Error
OfficeDevPnP.Core.Tests.Sites.SiteCollectionTests.CreateTeamNoGroupSiteTestAsync 00:02:35 TestCleanup method OfficeDevPnP.Core.Tests.Sites.SiteCollectionTests.CleanUp threw exception. Microsoft.SharePoint.Client.ServerException: Microsoft.SharePoint.Client.ServerException: File Not Found..
OfficeDevPnP.Core.Tests.Sites.ALMTests.DeployRetractAppAsyncTest 00:00:12 Test method OfficeDevPnP.Core.Tests.Sites.ALMTests.DeployRetractAppAsyncTest threw exception: System.InvalidOperationException: The request message was already sent. Cannot send the same request message multiple times.
OfficeDevPnP.Core.Tests.Sites.ALMTests.DeployRetractAppTest 00:00:12 Test method OfficeDevPnP.Core.Tests.Sites.ALMTests.DeployRetractAppTest threw exception: System.InvalidOperationException: The request message was already sent. Cannot send the same request message multiple times.
OfficeDevPnP.Core.Tests.AppModelExtensions.NavigationExtensionsTests.DeleteTopNavigationNodeTest 00:00:00 Test method OfficeDevPnP.Core.Tests.AppModelExtensions.NavigationExtensionsTests.DeleteTopNavigationNodeTest threw exception: System.InvalidOperationException: Sequence contains more than one matching element
OfficeDevPnP.Core.Tests.Framework.Functional.SecurityTests.SiteCollectionSecurityTest N/A Test 'SiteCollectionSecurityTest' exceeded execution timeout period.
OfficeDevPnP.Core.Tests.Framework.Functional.RegionalSettingsNoScriptTests.WebRegionalSettingsTest N/A Class Initialization method OfficeDevPnP.Core.Tests.Framework.Functional.RegionalSettingsNoScriptTests.ClassInit threw exception. System.Threading.ThreadAbortException: System.Threading.ThreadAbortException: Thread was being aborted..
OfficeDevPnP.Core.Tests.Framework.Functional.RegionalSettingsNoScriptTests.SiteCollectionRegionalSettingsTest N/A Test 'SiteCollectionRegionalSettingsTest' exceeded execution timeout period.
OfficeDevPnP.Core.Tests.Framework.Functional.PropertyBagNoScriptTests.WebPropertyBagAddingTest N/A Class Initialization method OfficeDevPnP.Core.Tests.Framework.Functional.PropertyBagNoScriptTests.ClassInit threw exception. System.Threading.ThreadAbortException: System.Threading.ThreadAbortException: Thread was being aborted..
OfficeDevPnP.Core.Tests.Framework.Functional.PropertyBagNoScriptTests.SiteCollectionPropertyBagAddingTest N/A Test 'SiteCollectionPropertyBagAddingTest' exceeded execution timeout period.
OfficeDevPnP.Core.Tests.Framework.Functional.LocalizationTest.SiteCollectionsLocalizationTest 00:00:18 Test 'SiteCollectionsLocalizationTest' exceeded execution timeout period.
Page 1 of 4

Notfound tests
Result Test Duration Error
No data found