Test run details - MTFirstReleaseCredentials - 11/7/2019 6:45:07 PM

Failed Tests | Skipped Tests | Notfound Tests | Passed Tests

Failed tests
Result Test      Search Duration Error
OfficeDevPnP.Core.Tests.AppModelExtensions.TenantExtensionsTests.SubSiteExistsTest 00:15:00 Test 'SubSiteExistsTest' exceeded execution timeout period.
OfficeDevPnP.Core.Tests.Framework.Functional.WorkflowsTests.SiteCollectionWorkflowsTest 00:01:12 Test 'SiteCollectionWorkflowsTest' exceeded execution timeout period.
OfficeDevPnP.Core.Tests.Framework.Functional.PropertyBagTests.WebPropertyBagAddingTest N/A Class Initialization method OfficeDevPnP.Core.Tests.Framework.Functional.PropertyBagTests.ClassInit threw exception. Microsoft.SharePoint.Client.ServerException: Microsoft.SharePoint.Client.ServerException: Cannot complete this action. Please try again..
OfficeDevPnP.Core.Tests.Framework.Functional.PropertyBagTests.SiteCollectionPropertyBagAddingTest N/A Class Initialization method OfficeDevPnP.Core.Tests.Framework.Functional.PropertyBagTests.ClassInit threw exception. Microsoft.SharePoint.Client.ServerException: Microsoft.SharePoint.Client.ServerException: Cannot complete this action. Please try again..
OfficeDevPnP.Core.Tests.Framework.Functional.SecurityNoScriptTests.SiteCollectionSecurityTest N/A Test 'SiteCollectionSecurityTest' exceeded execution timeout period.
OfficeDevPnP.Core.Tests.Framework.Functional.SearchSettingNoScriptTests.Web1605SearchSettingsTest N/A Class Initialization method OfficeDevPnP.Core.Tests.Framework.Functional.SearchSettingNoScriptTests.ClassInit threw exception. System.Threading.ThreadAbortException: System.Threading.ThreadAbortException: Thread was being aborted..
OfficeDevPnP.Core.Tests.Framework.Functional.SearchSettingNoScriptTests.SiteCollection1605SearchSettingsTest N/A Test 'SiteCollection1605SearchSettingsTest' exceeded execution timeout period.
OfficeDevPnP.Core.Tests.Framework.Functional.RegionalSettingsNoScriptTests.WebRegionalSettingsTest N/A Class Initialization method OfficeDevPnP.Core.Tests.Framework.Functional.RegionalSettingsNoScriptTests.ClassInit threw exception. System.Threading.ThreadAbortException: System.Threading.ThreadAbortException: Thread was being aborted..
OfficeDevPnP.Core.Tests.Framework.Functional.RegionalSettingsNoScriptTests.SiteCollectionRegionalSettingsTest N/A Test 'SiteCollectionRegionalSettingsTest' exceeded execution timeout period.
OfficeDevPnP.Core.Tests.Framework.Functional.PublishingNoScriptTest.SiteCollectionPublishingTest N/A Class Initialization method OfficeDevPnP.Core.Tests.Framework.Functional.PublishingNoScriptTest.ClassInit threw exception. Microsoft.SharePoint.Client.ServerException: Microsoft.SharePoint.Client.ServerException: .
Page 1 of 5

Notfound tests
Result Test Duration Error
No data found