Test run details - AzureVMSP2019Credentials - 11/7/2019 6:05:09 PM

Failed Tests | Skipped Tests | Notfound Tests | Passed Tests

Failed tests
Result Test      Search Duration Error
OfficeDevPnP.Core.Tests.Framework.Functional.ContentTypeTests.SiteCollectionContentTypeAddingTest 00:00:17 Test method OfficeDevPnP.Core.Tests.Framework.Functional.ContentTypeTests.SiteCollectionContentTypeAddingTest threw exception: Microsoft.SharePoint.Client.ServerException: The content type "CT_10" at "/sites/TestPnPSC_12345_4a8ed449-3d4c-4095-b0a6-db71510d1870" is read only.
OfficeDevPnP.Core.Tests.Framework.ObjectHandlers.ObjectWorkflowsTests.UpdatWorkflowSubscription 00:00:00 Test method OfficeDevPnP.Core.Tests.Framework.ObjectHandlers.ObjectWorkflowsTests.UpdatWorkflowSubscription threw exception: Microsoft.SharePoint.Client.ServerException: Cannot invoke method or retrieve property from null object. Object returned by the following call stack is null. "GetWorkflowDeploymentService new Microsoft.SharePoint.WorkflowServices.WorkflowServicesManager() "
OfficeDevPnP.Core.Tests.Framework.ObjectHandlers.ObjectSiteSecurityTests.CanProvisionNewAssociatedGroup 00:00:01 Assert.IsTrue failed.
OfficeDevPnP.Core.Tests.Framework.ObjectHandlers.ObjectSiteSecurityTests.CanProvisionAssociatedGroups 00:00:02 Assert.IsNotNull failed.
OfficeDevPnP.Core.Tests.Framework.ObjectHandlers.ObjectSiteSecurityTests.CanCreateEntities2 00:00:01 Assert.IsFalse failed.
Microsoft.SharePoint.Client.Tests.WebExtensionsTests.RemoveAppInstanceByTitleTest 00:00:02 Test method Microsoft.SharePoint.Client.Tests.WebExtensionsTests.RemoveAppInstanceByTitleTest threw exception: Microsoft.SharePoint.Client.ServerException: Sideloading of apps is not enabled on this site.
Microsoft.SharePoint.Client.Tests.WebExtensionsTests.GetAppInstancesTest 00:00:02 Test method Microsoft.SharePoint.Client.Tests.WebExtensionsTests.GetAppInstancesTest threw exception: Microsoft.SharePoint.Client.ServerException: Sideloading of apps is not enabled on this site.
Microsoft.SharePoint.Client.Tests.FieldAndContentTypeExtensionsTests.ThrowsArgumentOutOfRangeExceptionWhenSettingDefaultContentThatDoesNotExistInList 00:00:03 Assert.AreEqual failed. Expected:<0x0101>. Actual:<0x01010042D15ED6C7300B4DA44661F8E2B9B16E>.
Page 1 of 1

Skipped tests
Result Test      Search Duration Error
OfficeDevPnP.Core.Tests.Authentication.HighTrustAuthenticationTests.CertificateFromStoreAppOnlyAuthenticationTest 00:00:00 Assert.Inconclusive failed. Not enough information to execute this test is passed via the app.config file.
OfficeDevPnP.Core.Tests.Authentication.HighTrustAuthenticationTests.CertificateFileAppOnlyAuthenticationTest 00:00:00 Assert.Inconclusive failed. Not enough information to execute this test is passed via the app.config file.
OfficeDevPnP.Core.Tests.Framework.Connectors.ConnectorAzureTests.AzureConnectorBackslashSupportTest 00:00:00 Assert.Inconclusive failed. No Azure Storage Key defined in App.Config, so can't test
OfficeDevPnP.Core.Tests.Framework.Connectors.ConnectorAzureTests.AzureConnectorDelete2FolderTest 00:00:00 Assert.Inconclusive failed. No Azure Storage Key defined in App.Config, so can't test
OfficeDevPnP.Core.Tests.Framework.Connectors.ConnectorAzureTests.AzureConnectorDelete2Test 00:00:00 Assert.Inconclusive failed. No Azure Storage Key defined in App.Config, so can't test
OfficeDevPnP.Core.Tests.Framework.Connectors.ConnectorAzureTests.AzureConnectorDelete1Test 00:00:00 Assert.Inconclusive failed. No Azure Storage Key defined in App.Config, so can't test
OfficeDevPnP.Core.Tests.Framework.Connectors.ConnectorAzureTests.AzureConnectorSaveStream3Test 00:00:00 Assert.Inconclusive failed. No Azure Storage Key defined in App.Config, so can't test
OfficeDevPnP.Core.Tests.Framework.Connectors.ConnectorAzureTests.AzureConnectorSaveStream2Folder2Test 00:00:00 Assert.Inconclusive failed. No Azure Storage Key defined in App.Config, so can't test
OfficeDevPnP.Core.Tests.Framework.Connectors.ConnectorAzureTests.AzureConnectorSaveStream2FolderTest 00:00:00 Assert.Inconclusive failed. No Azure Storage Key defined in App.Config, so can't test
OfficeDevPnP.Core.Tests.Framework.Connectors.ConnectorAzureTests.AzureConnectorSaveStream2Test 00:00:00 Assert.Inconclusive failed. No Azure Storage Key defined in App.Config, so can't test
Page 1 of 3

Notfound tests
Result Test Duration Error
No data found