Test run details - MTFirstReleaseAppOnly - 11/7/2019 4:31:23 AM

Failed Tests | Skipped Tests | Notfound Tests | Passed Tests

Failed tests
Result Test      Search Duration Error
OfficeDevPnP.Core.Tests.Sites.ALMTests.DeployRetractAppAsyncTest 00:00:14 Test method OfficeDevPnP.Core.Tests.Sites.ALMTests.DeployRetractAppAsyncTest threw exception: System.InvalidOperationException: The request message was already sent. Cannot send the same request message multiple times.
OfficeDevPnP.Core.Tests.Sites.ALMTests.DeployRetractAppTest 00:00:13 Test method OfficeDevPnP.Core.Tests.Sites.ALMTests.DeployRetractAppTest threw exception: System.InvalidOperationException: The request message was already sent. Cannot send the same request message multiple times.
OfficeDevPnP.Core.Tests.AppModelExtensions.NavigationExtensionsTests.DeleteTopNavigationNodeTest 00:00:01 Test method OfficeDevPnP.Core.Tests.AppModelExtensions.NavigationExtensionsTests.DeleteTopNavigationNodeTest threw exception: System.InvalidOperationException: Sequence contains more than one matching element
OfficeDevPnP.Core.Tests.AppModelExtensions.TenantExtensionsTests.SubSiteExistsTest 00:15:00 Test 'SubSiteExistsTest' exceeded execution timeout period.
OfficeDevPnP.Core.Tests.Framework.CanProvisionRules.CanProvisionTests.CanProvisionHierarchy 00:00:04 Assert.IsTrue failed.
OfficeDevPnP.Core.Tests.Framework.CanProvisionRules.CanProvisionTests.CanProvisionSite 00:00:13 Assert.IsTrue failed.
OfficeDevPnP.Core.Tests.Framework.Functional.WorkflowsTests.WebWorkflowsTest N/A Class Initialization method OfficeDevPnP.Core.Tests.Framework.Functional.WorkflowsTests.ClassInit threw exception. System.Threading.ThreadAbortException: System.Threading.ThreadAbortException: Thread was being aborted..
OfficeDevPnP.Core.Tests.Framework.Functional.WorkflowsTests.SiteCollectionWorkflowsTest N/A Test 'SiteCollectionWorkflowsTest' exceeded execution timeout period.
OfficeDevPnP.Core.Tests.Framework.Functional.WorkflowsNoScriptTests.WebWorkflowsTest N/A Class Initialization method OfficeDevPnP.Core.Tests.Framework.Functional.WorkflowsNoScriptTests.ClassInit threw exception. System.Threading.ThreadAbortException: System.Threading.ThreadAbortException: Thread was being aborted..
OfficeDevPnP.Core.Tests.Framework.Functional.WorkflowsNoScriptTests.SiteCollectionWorkflowsTest N/A Test 'SiteCollectionWorkflowsTest' exceeded execution timeout period.
Page 1 of 7

Skipped tests
Result Test      Search Duration Error
OfficeDevPnP.Core.Tests.Sites.SiteCollectionTests.CreateTeamNoGroupSiteTestAsync 00:00:00 Assert.Inconclusive failed. Test that require modern site collection creation are not supported in app-only.
OfficeDevPnP.Core.Tests.Sites.SiteCollectionTests.CreateCommunicationSiteTestAsync 00:00:00 Assert.Inconclusive failed. Test that require modern site collection creation are not supported in app-only.
OfficeDevPnP.Core.Tests.AppModelExtensions.TenantExtensionsTests.GetUserProfileServiceClientTest 00:00:00 Assert.Inconclusive failed. Web service tests are not supported when testing using app-only
OfficeDevPnP.Core.Tests.AppModelExtensions.TenantExtensionsTests.GetOneDriveSiteCollectionsTest 00:00:00 Assert.Inconclusive failed. Web service tests are not supported when testing using app-only
OfficeDevPnP.Core.Tests.AppModelExtensions.FileFolderExtensionsTests.UploadFileWebDavTest 00:00:02 Assert.Inconclusive failed. Tests involving webdav are not supported when testing using app-only
OfficeDevPnP.Core.Tests.AppModelExtensions.SearchExtensionsTests.TestSiteSearchTest 00:00:00 Assert.Inconclusive failed. Search tests are not supported when testing using app-only
OfficeDevPnP.Core.Tests.AppModelExtensions.SearchExtensionsTests.GetSearchConfigurationFromSiteTest 00:00:00 Assert.Inconclusive failed. Search tests are not supported when testing using app-only
OfficeDevPnP.Core.Tests.AppModelExtensions.SearchExtensionsTests.GetSearchConfigurationFromWebTest 00:00:00 Assert.Inconclusive failed. Search tests are not supported when testing using app-only
OfficeDevPnP.Core.Tests.AppModelExtensions.SearchExtensionsTests.SetSiteCollectionSearchCenterUrlTest 00:00:00 Assert.Inconclusive failed. Search tests are not supported when testing using app-only
OfficeDevPnP.Core.Tests.Framework.Functional.TermGroupTests.WebTermGroupTest 00:00:00 Assert.Inconclusive failed. Test that require taxonomy creation are not supported in app-only.
Page 1 of 6

Notfound tests
Result Test Duration Error
No data found