Test run details - MTFirstReleaseCredentials - 10/8/2019 6:45:07 PM

Failed Tests | Skipped Tests | Notfound Tests | Passed Tests

Failed tests
Result Test      Search Duration Error
OfficeDevPnP.Core.Tests.Sites.SiteCollectionTests.CreateTeamNoGroupSiteTestAsync 00:00:06 TestCleanup method OfficeDevPnP.Core.Tests.Sites.SiteCollectionTests.CleanUp threw exception. Microsoft.SharePoint.Client.ServerException: Microsoft.SharePoint.Client.ServerException: File Not Found..
OfficeDevPnP.Core.Tests.Sites.ALMTests.DeployRetractAppAsyncTest 00:00:12 Test method OfficeDevPnP.Core.Tests.Sites.ALMTests.DeployRetractAppAsyncTest threw exception: System.InvalidOperationException: The request message was already sent. Cannot send the same request message multiple times.
OfficeDevPnP.Core.Tests.Sites.ALMTests.DeployRetractAppTest 00:00:12 Test method OfficeDevPnP.Core.Tests.Sites.ALMTests.DeployRetractAppTest threw exception: System.InvalidOperationException: The request message was already sent. Cannot send the same request message multiple times.
OfficeDevPnP.Core.Tests.AppModelExtensions.NavigationExtensionsTests.DeleteTopNavigationNodeTest 00:00:00 Test method OfficeDevPnP.Core.Tests.AppModelExtensions.NavigationExtensionsTests.DeleteTopNavigationNodeTest threw exception: System.InvalidOperationException: Sequence contains more than one matching element
OfficeDevPnP.Core.Tests.Framework.Functional.WorkflowsNoScriptTests.WebWorkflowsTest N/A Class Initialization method OfficeDevPnP.Core.Tests.Framework.Functional.WorkflowsNoScriptTests.ClassInit threw exception. System.Threading.ThreadAbortException: System.Threading.ThreadAbortException: Thread was being aborted..
OfficeDevPnP.Core.Tests.Framework.Functional.WorkflowsNoScriptTests.SiteCollectionWorkflowsTest N/A Test 'SiteCollectionWorkflowsTest' exceeded execution timeout period.
OfficeDevPnP.Core.Tests.Framework.Functional.PropertyBagTests.WebPropertyBagAddingTest 00:00:11 Test method OfficeDevPnP.Core.Tests.Framework.Functional.PropertyBagTests.WebPropertyBagAddingTest threw exception: Microsoft.SharePoint.Client.ServerException: There is no Web named "/sites/TestPnPSC_12345_286219e0-dba1-408d-a7d6-80f534397080/sub".
OfficeDevPnP.Core.Tests.Framework.Functional.SearchSettingTests.Web1605SearchSettingsTest N/A Class Initialization method OfficeDevPnP.Core.Tests.Framework.Functional.SearchSettingTests.ClassInit threw exception. System.Threading.ThreadAbortException: System.Threading.ThreadAbortException: Thread was being aborted..
OfficeDevPnP.Core.Tests.Framework.Functional.SearchSettingTests.SiteCollection1605SearchSettingsTest N/A Test 'SiteCollection1605SearchSettingsTest' exceeded execution timeout period.
OfficeDevPnP.Core.Tests.Framework.Functional.TermGroupTests.WebTermGroupTest N/A Class Initialization method OfficeDevPnP.Core.Tests.Framework.Functional.TermGroupTests.ClassInit threw exception. System.Threading.ThreadAbortException: System.Threading.ThreadAbortException: Thread was being aborted..
Page 1 of 6

Notfound tests
Result Test Duration Error
No data found