Test run details - MTFirstReleaseCredentials - 9/10/2019 6:45:06 PM

Failed Tests | Skipped Tests | Notfound Tests | Passed Tests

Failed tests
Result Test      Search Duration Error
OfficeDevPnP.Core.Tests.Sites.SiteCollectionTests.CreateTeamNoGroupSiteTestAsync 00:00:03 TestCleanup method OfficeDevPnP.Core.Tests.Sites.SiteCollectionTests.CleanUp threw exception. Microsoft.SharePoint.Client.ServerException: Microsoft.SharePoint.Client.ServerException: File Not Found..
OfficeDevPnP.Core.Tests.AppModelExtensions.NavigationExtensionsTests.DeleteTopNavigationNodeTest 00:00:00 Test method OfficeDevPnP.Core.Tests.AppModelExtensions.NavigationExtensionsTests.DeleteTopNavigationNodeTest threw exception: System.InvalidOperationException: Sequence contains more than one matching element
OfficeDevPnP.Core.Tests.Framework.Functional.WorkflowsTests.SiteCollectionWorkflowsTest 00:00:05 Test method OfficeDevPnP.Core.Tests.Framework.Functional.WorkflowsTests.SiteCollectionWorkflowsTest threw exception: System.Exception: Referenced content type 0x0108003365C4474CAE8C42BCE396314E88E51F not available in site or in template
OfficeDevPnP.Core.Tests.Framework.Functional.WorkflowsNoScriptTests.SiteCollectionWorkflowsTest 00:00:05 Test method OfficeDevPnP.Core.Tests.Framework.Functional.WorkflowsNoScriptTests.SiteCollectionWorkflowsTest threw exception: System.Exception: Referenced content type 0x0108003365C4474CAE8C42BCE396314E88E51F not available in site or in template
OfficeDevPnP.Core.Tests.Framework.Functional.ListNoScriptTests.SiteCollectionListAddingTest 00:00:29 Test method OfficeDevPnP.Core.Tests.Framework.Functional.ListNoScriptTests.SiteCollectionListAddingTest threw exception: Microsoft.SharePoint.Client.ServerException: Exception from HRESULT: 0x80131904
OfficeDevPnP.Core.Tests.Framework.ObjectHandlers.ObjectSiteSecurityTests.CanCreateNewAssociatedGroupsInNewScriptSite_AfterAsyncRename 00:04:21 Assert.Fail failed. Waiting for async group title change timed out. Try increasing the maxWaitMs.
OfficeDevPnP.Core.Tests.Framework.ObjectHandlers.ObjectSiteSecurityTests.CanCreateNewAssociatedGroupsInNewScriptSite_BeforeAsyncRename 00:04:22 Assert.Fail failed. Waiting for async group title change timed out. Try increasing the maxWaitMs.
OfficeDevPnP.Core.Tests.Framework.ObjectHandlers.ObjectSiteSecurityTests.CanMapAssociatedGroupsToExistingOnesInNewScriptSite 00:04:22 Assert.Fail failed. Waiting for async group title change timed out. Try increasing the maxWaitMs.
OfficeDevPnP.Core.Tests.Framework.ObjectHandlers.ObjectSiteSecurityTests.CanExportAndImportAssociatedGroupsProperlyInNewNoScriptSite 00:08:55 Assert.Fail failed. Waiting for async group title change timed out. Try increasing the maxWaitMs.
OfficeDevPnP.Core.Tests.Framework.ObjectHandlers.ObjectSiteSecurityTests.CanProvisionNewAssociatedGroup 00:00:03 Assert.IsTrue failed.
Page 1 of 3

Notfound tests
Result Test Duration Error
No data found