Test run details - MTFirstReleaseAppOnly - 9/10/2019 12:07:32 AM

Failed Tests | Skipped Tests | Notfound Tests | Passed Tests

Failed tests
Result Test      Search Duration Error
OfficeDevPnP.Core.Tests.AppModelExtensions.NavigationExtensionsTests.DeleteTopNavigationNodeTest 00:00:01 Test method OfficeDevPnP.Core.Tests.AppModelExtensions.NavigationExtensionsTests.DeleteTopNavigationNodeTest threw exception: System.InvalidOperationException: Sequence contains more than one matching element
OfficeDevPnP.Core.Tests.Framework.CanProvisionRules.CanProvisionTests.CanProvisionHierarchy 00:00:04 Assert.IsTrue failed.
OfficeDevPnP.Core.Tests.Framework.CanProvisionRules.CanProvisionTests.CanProvisionSite 00:00:08 Assert.IsTrue failed.
OfficeDevPnP.Core.Tests.Framework.Functional.WorkflowsTests.SiteCollectionWorkflowsTest 00:00:08 Test method OfficeDevPnP.Core.Tests.Framework.Functional.WorkflowsTests.SiteCollectionWorkflowsTest threw exception: System.Exception: Referenced content type 0x0108003365C4474CAE8C42BCE396314E88E51F not available in site or in template
OfficeDevPnP.Core.Tests.Framework.Functional.WorkflowsNoScriptTests.SiteCollectionWorkflowsTest 00:00:05 Test method OfficeDevPnP.Core.Tests.Framework.Functional.WorkflowsNoScriptTests.SiteCollectionWorkflowsTest threw exception: System.Exception: Referenced content type 0x0108003365C4474CAE8C42BCE396314E88E51F not available in site or in template
OfficeDevPnP.Core.Tests.Framework.Functional.WebSettingsTests.WebWebSettingsTest N/A Class Initialization method OfficeDevPnP.Core.Tests.Framework.Functional.WebSettingsTests.ClassInit threw exception. System.Threading.ThreadAbortException: System.Threading.ThreadAbortException: Thread was being aborted..
OfficeDevPnP.Core.Tests.Framework.Functional.WebSettingsTests.SiteCollectionAuditSettingsTest N/A Class Initialization method OfficeDevPnP.Core.Tests.Framework.Functional.WebSettingsTests.ClassInit threw exception. System.Threading.ThreadAbortException: System.Threading.ThreadAbortException: Thread was being aborted..
OfficeDevPnP.Core.Tests.Framework.Functional.WebSettingsTests.SiteCollectionWebSettingsTest N/A Test 'SiteCollectionWebSettingsTest' exceeded execution timeout period.
OfficeDevPnP.Core.Tests.Framework.Functional.LocalizationTest.WebLocalizationTest N/A Class Initialization method OfficeDevPnP.Core.Tests.Framework.Functional.LocalizationTest.ClassInit threw exception. System.Threading.ThreadAbortException: System.Threading.ThreadAbortException: Thread was being aborted..
OfficeDevPnP.Core.Tests.Framework.Functional.LocalizationTest.SiteCollectionsLocalizationTest N/A Test 'SiteCollectionsLocalizationTest' exceeded execution timeout period.
Page 1 of 4

Skipped tests
Result Test      Search Duration Error
OfficeDevPnP.Core.Tests.Sites.SiteCollectionTests.CreateTeamNoGroupSiteTestAsync 00:00:00 Assert.Inconclusive failed. Test that require modern site collection creation are not supported in app-only.
OfficeDevPnP.Core.Tests.Sites.SiteCollectionTests.CreateCommunicationSiteTestAsync 00:00:00 Assert.Inconclusive failed. Test that require modern site collection creation are not supported in app-only.
OfficeDevPnP.Core.Tests.AppModelExtensions.TenantExtensionsTests.GetUserProfileServiceClientTest 00:00:00 Assert.Inconclusive failed. Web service tests are not supported when testing using app-only
OfficeDevPnP.Core.Tests.AppModelExtensions.TenantExtensionsTests.GetOneDriveSiteCollectionsTest 00:00:00 Assert.Inconclusive failed. Web service tests are not supported when testing using app-only
OfficeDevPnP.Core.Tests.AppModelExtensions.FileFolderExtensionsTests.UploadFileWebDavTest 00:00:03 Assert.Inconclusive failed. Tests involving webdav are not supported when testing using app-only
OfficeDevPnP.Core.Tests.AppModelExtensions.SearchExtensionsTests.TestSiteSearchTest 00:00:00 Assert.Inconclusive failed. Search tests are not supported when testing using app-only
OfficeDevPnP.Core.Tests.AppModelExtensions.SearchExtensionsTests.GetSearchConfigurationFromSiteTest 00:00:00 Assert.Inconclusive failed. Search tests are not supported when testing using app-only
OfficeDevPnP.Core.Tests.AppModelExtensions.SearchExtensionsTests.GetSearchConfigurationFromWebTest 00:00:00 Assert.Inconclusive failed. Search tests are not supported when testing using app-only
OfficeDevPnP.Core.Tests.AppModelExtensions.SearchExtensionsTests.SetSiteCollectionSearchCenterUrlTest 00:00:00 Assert.Inconclusive failed. Search tests are not supported when testing using app-only
OfficeDevPnP.Core.Tests.Framework.Functional.SearchSettingTests.Web1605SearchSettingsTest 00:00:00 Assert.Inconclusive failed. Test that require search settings are not supported in app-only.
Page 1 of 7

Notfound tests
Result Test Duration Error
No data found