Test run details - MTFirstReleaseCredentials - 8/13/2019 6:45:07 PM

Failed Tests | Skipped Tests | Notfound Tests | Passed Tests

Failed tests
Result Test      Search Duration Error
OfficeDevPnP.Core.Tests.AppModelExtensions.NavigationExtensionsTests.DeleteTopNavigationNodeTest 00:00:00 Test method OfficeDevPnP.Core.Tests.AppModelExtensions.NavigationExtensionsTests.DeleteTopNavigationNodeTest threw exception: System.InvalidOperationException: Sequence contains more than one matching element
OfficeDevPnP.Core.Tests.Framework.Functional.WorkflowsTests.SiteCollectionWorkflowsTest 00:00:03 Test method OfficeDevPnP.Core.Tests.Framework.Functional.WorkflowsTests.SiteCollectionWorkflowsTest threw exception: System.Exception: Referenced content type 0x0108003365C4474CAE8C42BCE396314E88E51F not available in site or in template
OfficeDevPnP.Core.Tests.Framework.Functional.PublishingNoScriptTest.SiteCollectionPublishingTest N/A Test 'SiteCollectionPublishingTest' exceeded execution timeout period.
OfficeDevPnP.Core.Tests.Framework.Functional.PropertyBagNoScriptTests.WebPropertyBagAddingTest N/A Class Initialization method OfficeDevPnP.Core.Tests.Framework.Functional.PropertyBagNoScriptTests.ClassInit threw exception. System.Threading.ThreadAbortException: System.Threading.ThreadAbortException: Thread was being aborted..
OfficeDevPnP.Core.Tests.Framework.Functional.PropertyBagNoScriptTests.SiteCollectionPropertyBagAddingTest N/A Test 'SiteCollectionPropertyBagAddingTest' exceeded execution timeout period.
OfficeDevPnP.Core.Tests.Framework.Functional.ListTests.SiteCollectionListAddingTest 00:09:22 Test 'SiteCollectionListAddingTest' exceeded execution timeout period.
OfficeDevPnP.Core.Tests.Framework.ObjectHandlers.ObjectSiteSecurityTests.CanProvisionNewAssociatedGroup 00:00:03 Assert.IsTrue failed.
OfficeDevPnP.Core.Tests.Framework.ObjectHandlers.ObjectSiteSecurityTests.CanProvisionAssociatedGroups 00:00:05 Assert.IsNotNull failed.
OfficeDevPnP.Core.Tests.Framework.ObjectHandlers.ObjectSiteSecurityTests.CanCreateEntities2 00:00:03 Assert.IsFalse failed.
OfficeDevPnP.Core.Tests.Framework.ObjectHandlers.ObjectTermGroupsTests.CanProvisionReusableTerms 00:00:17 Assert.AreEqual failed. Expected:<2>. Actual:<3>.
Page 1 of 2

Notfound tests
Result Test Duration Error
No data found