Test run details - MTFirstReleaseCredentials - 8/12/2019 6:45:07 PM

Failed Tests | Skipped Tests | Notfound Tests | Passed Tests

Failed tests
Result Test      Search Duration Error
OfficeDevPnP.Core.Tests.AppModelExtensions.NavigationExtensionsTests.DeleteTopNavigationNodeTest 00:00:00 Test method OfficeDevPnP.Core.Tests.AppModelExtensions.NavigationExtensionsTests.DeleteTopNavigationNodeTest threw exception: System.InvalidOperationException: Sequence contains more than one matching element
OfficeDevPnP.Core.Tests.Framework.Functional.WorkflowsTests.SiteCollectionWorkflowsTest 00:00:03 Test method OfficeDevPnP.Core.Tests.Framework.Functional.WorkflowsTests.SiteCollectionWorkflowsTest threw exception: System.Exception: Referenced content type 0x0108003365C4474CAE8C42BCE396314E88E51F not available in site or in template
OfficeDevPnP.Core.Tests.Framework.ObjectHandlers.ObjectSiteSecurityTests.CanProvisionNewAssociatedGroup 00:00:04 Assert.IsTrue failed.
OfficeDevPnP.Core.Tests.Framework.ObjectHandlers.ObjectSiteSecurityTests.CanProvisionAssociatedGroups 00:00:05 Assert.IsNotNull failed.
OfficeDevPnP.Core.Tests.Framework.ObjectHandlers.ObjectSiteSecurityTests.CanCreateEntities2 00:00:03 Assert.IsFalse failed.
OfficeDevPnP.Core.Tests.Framework.ObjectHandlers.ObjectTermGroupsTests.CanProvisionReusableTerms 00:00:19 Assert.AreEqual failed. Expected:<2>. Actual:<3>.
OfficeDevPnP.Core.Tests.Framework.ObjectHandlers.ObjectTermGroupsTests.CanProvisionObjects 00:00:01 Test method OfficeDevPnP.Core.Tests.Framework.ObjectHandlers.ObjectTermGroupsTests.CanProvisionObjects threw exception: Microsoft.SharePoint.Client.CollectionNotInitializedException: The collection has not been initialized. It has not been requested or the request has not been executed. It may need to be explicitly requested.
OfficeDevPnP.Core.Tests.Framework.ObjectHandlers.ObjectTeamsTests.CanUpdateObjects 00:00:00 Test method OfficeDevPnP.Core.Tests.Framework.ObjectHandlers.ObjectTeamsTests.CanUpdateObjects threw exception: System.ApplicationException: Exception while invoking endpoint https://login.microsoftonline.com/d8623c9e-30c7-473a-83bc-d907df44a26e/oauth2/v2.0/token. ---> System.Web.HttpException: {"error":"invalid_request","error_description":"AADSTS900144: The request body must contain the following parameter: 'client_id'.\r\nTrace ID: c1ae97fb-e333-4298-938d-d65f43155700\r\nCorrelation ID: dd6f1882-ec86-4112-b898-d53b2dd84252\r\nTimestamp: 2019-08-12 19:23:45Z","error_codes":[900144],"timestamp":"2019-08-12 19:23:45Z","trace_id":"c1ae97fb-e333-4298-938d-d65f43155700","correlation_id":"dd6f1882-ec86-4112-b898-d53b2dd84252","error_uri":"https://login.microsoftonline.com/error?code=900144"} TestCleanup method OfficeDevPnP.Core.Tests.Framework.ObjectHandlers.ObjectTeamsTests.CleanUp threw exception. System.ApplicationException: System.ApplicationException: Exception while invoking endpoint https://login.microsoftonline.com/d8623c9e-30c7-473a-83bc-d907df44a26e/oauth2/v2.0/token. ---> System.Web.HttpException: {"error":"invalid_request","error_description":"AADSTS900144: The request body must contain the following parameter: 'client_id'.\r\nTrace ID: b6e4040f-9dfb-47c1-aaa5-2f33dff35600\r\nCorrelation ID: 2abe4c3d-f7e5-44e3-9a76-16e57a8e8cd0\r\nTimestamp: 2019-08-12 19:23:45Z","error_codes":[900144],"timestamp":"2019-08-12 19:23:45Z","trace_id":"b6e4040f-9dfb-47c1-aaa5-2f33dff35600","correlation_id":"2abe4c3d-f7e5-44e3-9a76-16e57a8e8cd0","error_uri":"https://login.microsoftonline.com/error?code=900144"}.
OfficeDevPnP.Core.Tests.Framework.ObjectHandlers.ObjectTeamsTests.CanProvisionObjects 00:00:00 Test method OfficeDevPnP.Core.Tests.Framework.ObjectHandlers.ObjectTeamsTests.CanProvisionObjects threw exception: System.ApplicationException: Exception while invoking endpoint https://login.microsoftonline.com/d8623c9e-30c7-473a-83bc-d907df44a26e/oauth2/v2.0/token. ---> System.Web.HttpException: {"error":"invalid_request","error_description":"AADSTS900144: The request body must contain the following parameter: 'client_id'.\r\nTrace ID: 7adec7ac-34a5-48d2-92c6-e6e4c6484e00\r\nCorrelation ID: 0eab3cd3-5583-4f0b-9374-9e80270955cb\r\nTimestamp: 2019-08-12 19:23:45Z","error_codes":[900144],"timestamp":"2019-08-12 19:23:45Z","trace_id":"7adec7ac-34a5-48d2-92c6-e6e4c6484e00","correlation_id":"0eab3cd3-5583-4f0b-9374-9e80270955cb","error_uri":"https://login.microsoftonline.com/error?code=900144"} TestCleanup method OfficeDevPnP.Core.Tests.Framework.ObjectHandlers.ObjectTeamsTests.CleanUp threw exception. System.ApplicationException: System.ApplicationException: Exception while invoking endpoint https://login.microsoftonline.com/d8623c9e-30c7-473a-83bc-d907df44a26e/oauth2/v2.0/token. ---> System.Web.HttpException: {"error":"invalid_request","error_description":"AADSTS900144: The request body must contain the following parameter: 'client_id'.\r\nTrace ID: 9a5f94d6-5be3-4673-b96a-31708fe35e00\r\nCorrelation ID: fa8c7a41-f296-4ede-98b8-963cdc4e7e46\r\nTimestamp: 2019-08-12 19:23:45Z","error_codes":[900144],"timestamp":"2019-08-12 19:23:45Z","trace_id":"9a5f94d6-5be3-4673-b96a-31708fe35e00","correlation_id":"fa8c7a41-f296-4ede-98b8-963cdc4e7e46","error_uri":"https://login.microsoftonline.com/error?code=900144"}.
OfficeDevPnP.Core.Tests.Framework.ProvisioningTemplates.ProvisioningTests.ProvisionTenantTemplate 00:00:15 Test method OfficeDevPnP.Core.Tests.Framework.ProvisioningTemplates.ProvisioningTests.ProvisionTenantTemplate threw exception: Microsoft.SharePoint.Client.ServerException: Specified argument was out of the range of valid values. Parameter name: lcid
Page 1 of 2

Notfound tests
Result Test Duration Error
No data found