Test run details - MTFirstReleaseCredentials - 7/11/2019 6:45:07 PM

Failed Tests | Skipped Tests | Notfound Tests | Passed Tests

Failed tests
Result Test      Search Duration Error
OfficeDevPnP.Core.Tests.AppModelExtensions.NavigationExtensionsTests.DeleteTopNavigationNodeTest 00:00:00 Test method OfficeDevPnP.Core.Tests.AppModelExtensions.NavigationExtensionsTests.DeleteTopNavigationNodeTest threw exception: System.InvalidOperationException: Sequence contains more than one matching element
OfficeDevPnP.Core.Tests.AppModelExtensions.TenantExtensionsTests.SetSiteLockStateTest 00:02:11 Test method OfficeDevPnP.Core.Tests.AppModelExtensions.TenantExtensionsTests.SetSiteLockStateTest threw exception: Microsoft.SharePoint.Client.ServerException: Unable to find the deleted site: https://bertonline.sharepoint.com/sites/TestPnPSC_123456789_134564e6-0767-4b00-b1ff-b39a38c44723.
OfficeDevPnP.Core.Tests.AppModelExtensions.TenantExtensionsTests.CreateDeleteCreateSiteCollectionTest 00:03:03 Test method OfficeDevPnP.Core.Tests.AppModelExtensions.TenantExtensionsTests.CreateDeleteCreateSiteCollectionTest threw exception: System.NullReferenceException: Object reference not set to an instance of an object.
OfficeDevPnP.Core.Tests.AppModelExtensions.TenantExtensionsTests.CreateDeleteSiteCollectionTest 00:01:41 Test method OfficeDevPnP.Core.Tests.AppModelExtensions.TenantExtensionsTests.CreateDeleteSiteCollectionTest threw exception: System.NullReferenceException: Object reference not set to an instance of an object.
OfficeDevPnP.Core.Tests.Framework.Functional.WorkflowsTests.SiteCollectionWorkflowsTest 00:00:04 Test method OfficeDevPnP.Core.Tests.Framework.Functional.WorkflowsTests.SiteCollectionWorkflowsTest threw exception: System.Exception: Referenced content type 0x0108003365C4474CAE8C42BCE396314E88E51F not available in site or in template
OfficeDevPnP.Core.Tests.Framework.Functional.WorkflowsNoScriptTests.WebWorkflowsTest N/A Class Initialization method OfficeDevPnP.Core.Tests.Framework.Functional.WorkflowsNoScriptTests.ClassInit threw exception. Microsoft.SharePoint.Client.PropertyOrFieldNotInitializedException: Microsoft.SharePoint.Client.PropertyOrFieldNotInitializedException: The property or field 'EffectiveBasePermissions' has not been initialized. It has not been requested or the request has not been executed. It may need to be explicitly requested..
OfficeDevPnP.Core.Tests.Framework.Functional.WorkflowsNoScriptTests.SiteCollectionWorkflowsTest N/A Class Initialization method OfficeDevPnP.Core.Tests.Framework.Functional.WorkflowsNoScriptTests.ClassInit threw exception. Microsoft.SharePoint.Client.PropertyOrFieldNotInitializedException: Microsoft.SharePoint.Client.PropertyOrFieldNotInitializedException: The property or field 'EffectiveBasePermissions' has not been initialized. It has not been requested or the request has not been executed. It may need to be explicitly requested..
OfficeDevPnP.Core.Tests.Framework.ObjectHandlers.ObjectSiteSecurityTests.CanCreateNewAssociatedGroupsInNewScriptSite_BeforeAsyncRename 00:04:22 Assert.Fail failed. Waiting for async group title change timed out. Try increasing the maxWaitMs.
OfficeDevPnP.Core.Tests.Framework.ObjectHandlers.ObjectSiteSecurityTests.CanProvisionNewAssociatedGroup 00:00:03 Assert.IsTrue failed.
OfficeDevPnP.Core.Tests.Framework.ObjectHandlers.ObjectSiteSecurityTests.CanProvisionAssociatedGroups 00:00:06 Assert.IsNotNull failed.
Page 1 of 2

Notfound tests
Result Test Duration Error
No data found