Test run details - MTFirstReleaseAppOnly - 7/10/2019 11:16:45 PM

Failed Tests | Skipped Tests | Notfound Tests | Passed Tests

Failed tests
Result Test      Search Duration Error
OfficeDevPnP.Core.Tests.AppModelExtensions.NavigationExtensionsTests.DeleteTopNavigationNodeTest 00:00:01 Test method OfficeDevPnP.Core.Tests.AppModelExtensions.NavigationExtensionsTests.DeleteTopNavigationNodeTest threw exception: System.InvalidOperationException: Sequence contains more than one matching element
OfficeDevPnP.Core.Tests.AppModelExtensions.TenantExtensionsTests.SetSiteLockStateTest 00:04:29 Test method OfficeDevPnP.Core.Tests.AppModelExtensions.TenantExtensionsTests.SetSiteLockStateTest threw exception: Microsoft.SharePoint.Client.ServerException: Unable to find the deleted site: https://bertonline.sharepoint.com/sites/TestPnPSC_123456789_8f7d8ca5-bf1c-4b3b-87e8-7e36e3dff3c4.
OfficeDevPnP.Core.Tests.AppModelExtensions.TenantExtensionsTests.CreateDeleteCreateSiteCollectionTest 00:03:56 Test method OfficeDevPnP.Core.Tests.AppModelExtensions.TenantExtensionsTests.CreateDeleteCreateSiteCollectionTest threw exception: System.NullReferenceException: Object reference not set to an instance of an object.
OfficeDevPnP.Core.Tests.AppModelExtensions.TenantExtensionsTests.CreateDeleteSiteCollectionTest 00:01:41 Test method OfficeDevPnP.Core.Tests.AppModelExtensions.TenantExtensionsTests.CreateDeleteSiteCollectionTest threw exception: System.NullReferenceException: Object reference not set to an instance of an object.
OfficeDevPnP.Core.Tests.Framework.CanProvisionRules.CanProvisionTests.CanProvisionHierarchy 00:00:04 Assert.IsTrue failed.
OfficeDevPnP.Core.Tests.Framework.CanProvisionRules.CanProvisionTests.CanProvisionSite 00:00:10 Assert.IsTrue failed.
OfficeDevPnP.Core.Tests.Framework.Functional.WorkflowsTests.SiteCollectionWorkflowsTest 00:00:06 Test method OfficeDevPnP.Core.Tests.Framework.Functional.WorkflowsTests.SiteCollectionWorkflowsTest threw exception: System.Exception: Referenced content type 0x0108003365C4474CAE8C42BCE396314E88E51F not available in site or in template
OfficeDevPnP.Core.Tests.Framework.Functional.WorkflowsNoScriptTests.SiteCollectionWorkflowsTest 00:00:05 Test method OfficeDevPnP.Core.Tests.Framework.Functional.WorkflowsNoScriptTests.SiteCollectionWorkflowsTest threw exception: System.Exception: Referenced content type 0x0108003365C4474CAE8C42BCE396314E88E51F not available in site or in template
OfficeDevPnP.Core.Tests.Framework.ObjectHandlers.ObjectSiteSecurityTests.CanMapToExistingGroupsInNewScriptSite 00:00:03 Test method OfficeDevPnP.Core.Tests.Framework.ObjectHandlers.ObjectSiteSecurityTests.CanMapToExistingGroupsInNewScriptSite threw exception: System.Exception: You need to set the owner in App-only context
OfficeDevPnP.Core.Tests.Framework.ObjectHandlers.ObjectSiteSecurityTests.CanCreateNewAssociatedGroupsInNewScriptSite_AfterAsyncRename 00:00:02 Test method OfficeDevPnP.Core.Tests.Framework.ObjectHandlers.ObjectSiteSecurityTests.CanCreateNewAssociatedGroupsInNewScriptSite_AfterAsyncRename threw exception: System.Exception: You need to set the owner in App-only context
Page 1 of 3

Skipped tests
Result Test      Search Duration Error
OfficeDevPnP.Core.Tests.Sites.SiteCollectionTests.CreateCommunicationSiteTestAsync 00:00:00 Assert.Inconclusive failed. Test that require modern site collection creation are not supported in app-only.
OfficeDevPnP.Core.Tests.AppModelExtensions.TenantExtensionsTests.GetUserProfileServiceClientTest 00:00:00 Assert.Inconclusive failed. Web service tests are not supported when testing using app-only
OfficeDevPnP.Core.Tests.AppModelExtensions.TenantExtensionsTests.GetOneDriveSiteCollectionsTest 00:00:00 Assert.Inconclusive failed. Web service tests are not supported when testing using app-only
OfficeDevPnP.Core.Tests.AppModelExtensions.FileFolderExtensionsTests.UploadFileWebDavTest 00:00:02 Assert.Inconclusive failed. Tests involving webdav are not supported when testing using app-only
OfficeDevPnP.Core.Tests.AppModelExtensions.SearchExtensionsTests.TestSiteSearchTest 00:00:00 Assert.Inconclusive failed. Search tests are not supported when testing using app-only
OfficeDevPnP.Core.Tests.AppModelExtensions.SearchExtensionsTests.GetSearchConfigurationFromSiteTest 00:00:00 Assert.Inconclusive failed. Search tests are not supported when testing using app-only
OfficeDevPnP.Core.Tests.AppModelExtensions.SearchExtensionsTests.GetSearchConfigurationFromWebTest 00:00:00 Assert.Inconclusive failed. Search tests are not supported when testing using app-only
OfficeDevPnP.Core.Tests.AppModelExtensions.SearchExtensionsTests.SetSiteCollectionSearchCenterUrlTest 00:00:00 Assert.Inconclusive failed. Search tests are not supported when testing using app-only
OfficeDevPnP.Core.Tests.Framework.Functional.SearchSettingTests.Web1605SearchSettingsTest 00:00:00 Assert.Inconclusive failed. Test that require search settings are not supported in app-only.
OfficeDevPnP.Core.Tests.Framework.Functional.SearchSettingTests.SiteCollection1605SearchSettingsTest 00:00:00 Assert.Inconclusive failed. Test that require search settings are not supported in app-only.
Page 1 of 7

Notfound tests
Result Test Duration Error
No data found