Test run details - MTFirstReleaseCredentials - 6/11/2019 6:45:05 PM

Failed Tests | Skipped Tests | Notfound Tests | Passed Tests

Failed tests
Result Test      Search Duration Error
OfficeDevPnP.Core.Tests.AppModelExtensions.NavigationExtensionsTests.DeleteTopNavigationNodeTest 00:00:00 Test method OfficeDevPnP.Core.Tests.AppModelExtensions.NavigationExtensionsTests.DeleteTopNavigationNodeTest threw exception: System.InvalidOperationException: Sequence contains more than one matching element
OfficeDevPnP.Core.Tests.Framework.Functional.WorkflowsTests.SiteCollectionWorkflowsTest 00:00:05 Test method OfficeDevPnP.Core.Tests.Framework.Functional.WorkflowsTests.SiteCollectionWorkflowsTest threw exception: System.Exception: Referenced content type 0x0108003365C4474CAE8C42BCE396314E88E51F not available in site or in template
OfficeDevPnP.Core.Tests.Framework.Functional.WorkflowsNoScriptTests.SiteCollectionWorkflowsTest 00:00:04 Test method OfficeDevPnP.Core.Tests.Framework.Functional.WorkflowsNoScriptTests.SiteCollectionWorkflowsTest threw exception: System.Exception: Referenced content type 0x0108003365C4474CAE8C42BCE396314E88E51F not available in site or in template
OfficeDevPnP.Core.Tests.Framework.Functional.WebSettingsTests.WebWebSettingsTest 00:00:04 Assert.IsTrue failed.
OfficeDevPnP.Core.Tests.Framework.Functional.WebSettingsTests.SiteCollectionWebSettingsTest 00:00:05 Assert.IsTrue failed.
OfficeDevPnP.Core.Tests.Framework.Functional.WebSettingsNoScriptTests.WebWebSettingsTest 00:00:04 Assert.IsTrue failed.
OfficeDevPnP.Core.Tests.Framework.Functional.WebSettingsNoScriptTests.SiteCollectionWebSettingsTest 00:00:04 Assert.IsTrue failed.
OfficeDevPnP.Core.Tests.Framework.Functional.ContentTypeTests.SiteCollectionContentTypeAddingTest 00:00:31 Assert.IsTrue failed.
OfficeDevPnP.Core.Tests.Framework.Functional.CustomActionTests.SiteCollectionCustomActionAddingTest 00:00:03 Assert.IsTrue failed.
OfficeDevPnP.Core.Tests.Framework.Functional.ListTests.Web1605ListAddingTest 00:00:24 Assert.IsTrue failed.
Page 1 of 4

Notfound tests
Result Test Duration Error
No data found