Test run details - AzureVMSP2016AppOnly - 5/14/2019 7:20:09 PM

Failed Tests | Skipped Tests | Notfound Tests | Passed Tests

Failed tests
Result Test      Search Duration Error
OfficeDevPnP.Core.Tests.AppModelExtensions.Tenant15ExtensionsTests.CreateDeleteSiteCollectionTest 00:00:00 Test method OfficeDevPnP.Core.Tests.AppModelExtensions.Tenant15ExtensionsTests.CreateDeleteSiteCollectionTest threw exception: Microsoft.SharePoint.Client.ServerException: Another site already exists at https://portal2016.pnp.com/sites/TestPnPSC_123456789. Delete this site before attempting to create a new site with the same URL, choose a new URL, or create a new inclusion at the path you originally specified.
OfficeDevPnP.Core.Tests.Framework.CanProvisionRules.CanProvisionTests.CanProvisionHierarchy 00:00:00 Test method OfficeDevPnP.Core.Tests.Framework.CanProvisionRules.CanProvisionTests.CanProvisionHierarchy threw exception: System.ArgumentException: Url of the site is required. Parameter name: siteUrl
OfficeDevPnP.Core.Tests.Framework.CanProvisionRules.CanProvisionTests.CanProvisionSite 00:00:00 Assert.IsTrue failed.
OfficeDevPnP.Core.Tests.Framework.Functional.WebSettingsTests.WebWebSettingsTest 00:00:02 Assert.IsTrue failed.
OfficeDevPnP.Core.Tests.Framework.Functional.WebSettingsTests.SiteCollectionWebSettingsTest 00:00:02 Assert.IsTrue failed.
OfficeDevPnP.Core.Tests.Framework.Functional.SecurityTests.SiteCollectionSecurityTest 00:00:00 Test method OfficeDevPnP.Core.Tests.Framework.Functional.SecurityTests.SiteCollectionSecurityTest threw exception: Microsoft.SharePoint.Client.PropertyOrFieldNotInitializedException: The property or field 'Title' has not been initialized. It has not been requested or the request has not been executed. It may need to be explicitly requested.
OfficeDevPnP.Core.Tests.Framework.Functional.LocalizationTest.WebLocalizationTest 00:00:04 Test method OfficeDevPnP.Core.Tests.Framework.Functional.LocalizationTest.WebLocalizationTest threw exception: System.ArgumentException: IDX12729: Unable to decode the header '[PII is hidden]' as Base64Url encoded string. jwtEncodedString: '[PII is hidden]'. ---> System.TypeInitializationException: The type initializer for 'System.IdentityModel.Tokens.Jwt.JsonExtensions' threw an exception. ---> System.IO.FileLoadException: Could not load file or assembly 'Newtonsoft.Json, Version=10.0.0.0, Culture=neutral, PublicKeyToken=30ad4fe6b2a6aeed' or one of its dependencies. The located assembly's manifest definition does not match the assembly reference. (Exception from HRESULT: 0x80131040)
OfficeDevPnP.Core.Tests.Framework.Functional.LocalizationTest.SiteCollectionsLocalizationTest 00:00:08 Test method OfficeDevPnP.Core.Tests.Framework.Functional.LocalizationTest.SiteCollectionsLocalizationTest threw exception: System.ArgumentException: IDX12729: Unable to decode the header '[PII is hidden]' as Base64Url encoded string. jwtEncodedString: '[PII is hidden]'. ---> System.TypeInitializationException: The type initializer for 'System.IdentityModel.Tokens.Jwt.JsonExtensions' threw an exception. ---> System.IO.FileLoadException: Could not load file or assembly 'Newtonsoft.Json, Version=10.0.0.0, Culture=neutral, PublicKeyToken=30ad4fe6b2a6aeed' or one of its dependencies. The located assembly's manifest definition does not match the assembly reference. (Exception from HRESULT: 0x80131040)
OfficeDevPnP.Core.Tests.Framework.Functional.ContentTypeTests.SiteCollectionContentTypeAddingTest 00:00:16 Assert.IsTrue failed.
OfficeDevPnP.Core.Tests.Framework.Functional.CustomActionTests.SiteCollectionCustomActionAddingTest 00:00:01 Assert.IsTrue failed.
Page 1 of 2

Skipped tests
Result Test      Search Duration Error
OfficeDevPnP.Core.Tests.Authentication.HighTrustAuthenticationTests.CertificateFromStoreAppOnlyAuthenticationTest 00:00:00 Assert.Inconclusive failed. Not enough information to execute this test is passed via the app.config file.
OfficeDevPnP.Core.Tests.Authentication.HighTrustAuthenticationTests.CertificateFileAppOnlyAuthenticationTest 00:00:00 Assert.Inconclusive failed. Not enough information to execute this test is passed via the app.config file.
OfficeDevPnP.Core.Tests.AppModelExtensions.FileFolderExtensionsTests.UploadFileWebDavTest 00:00:00 Assert.Inconclusive failed. Tests involving webdav are not supported when testing using app-only
OfficeDevPnP.Core.Tests.AppModelExtensions.SearchExtensionsTests.TestSiteSearchTest 00:00:00 Assert.Inconclusive failed. Search tests are not supported when testing using app-only
OfficeDevPnP.Core.Tests.AppModelExtensions.SearchExtensionsTests.GetSearchConfigurationFromSiteTest 00:00:00 Assert.Inconclusive failed. Search tests are not supported when testing using app-only
OfficeDevPnP.Core.Tests.AppModelExtensions.SearchExtensionsTests.GetSearchConfigurationFromWebTest 00:00:00 Assert.Inconclusive failed. Search tests are not supported when testing using app-only
OfficeDevPnP.Core.Tests.AppModelExtensions.SearchExtensionsTests.SetSiteCollectionSearchCenterUrlTest 00:00:00 Assert.Inconclusive failed. Search tests are not supported when testing using app-only
OfficeDevPnP.Core.Tests.Framework.Connectors.ConnectorAzureTests.AzureConnectorBackslashSupportTest 00:00:00 Assert.Inconclusive failed. No Azure Storage Key defined in App.Config, so can't test
OfficeDevPnP.Core.Tests.Framework.Connectors.ConnectorAzureTests.AzureConnectorDelete2FolderTest 00:00:00 Assert.Inconclusive failed. No Azure Storage Key defined in App.Config, so can't test
OfficeDevPnP.Core.Tests.Framework.Connectors.ConnectorAzureTests.AzureConnectorDelete2Test 00:00:00 Assert.Inconclusive failed. No Azure Storage Key defined in App.Config, so can't test
Page 1 of 8

Notfound tests
Result Test Duration Error
No data found