Test run details - MTFirstReleaseCredentials - 4/14/2019 6:45:05 PM

Failed Tests | Skipped Tests | Notfound Tests | Passed Tests

Failed tests
Result Test      Search Duration Error
OfficeDevPnP.Core.Tests.AppModelExtensions.NavigationExtensionsTests.DeleteSearchNavigationNodeTest 00:00:01 Test method OfficeDevPnP.Core.Tests.AppModelExtensions.NavigationExtensionsTests.DeleteSearchNavigationNodeTest threw exception: System.InvalidOperationException: Sequence contains more than one matching element
OfficeDevPnP.Core.Tests.AppModelExtensions.NavigationExtensionsTests.DeleteTopNavigationNodeTest 00:00:00 Test method OfficeDevPnP.Core.Tests.AppModelExtensions.NavigationExtensionsTests.DeleteTopNavigationNodeTest threw exception: System.InvalidOperationException: Sequence contains more than one matching element
OfficeDevPnP.Core.Tests.Framework.Functional.WorkflowsTests.SiteCollectionWorkflowsTest 00:00:22 Test method OfficeDevPnP.Core.Tests.Framework.Functional.WorkflowsTests.SiteCollectionWorkflowsTest threw exception: System.Exception: Referenced content type 0x0108003365C4474CAE8C42BCE396314E88E51F not available in site or in template
OfficeDevPnP.Core.Tests.Framework.Functional.TermGroupTests.WebTermGroupTest 00:01:26 Assert.IsTrue failed.
OfficeDevPnP.Core.Tests.Framework.Functional.TermGroupTests.SiteCollectionTermGroupTest 00:01:39 Assert.IsTrue failed.
OfficeDevPnP.Core.Tests.Framework.Functional.TermGroupNoScriptTests.WebTermGroupTest 00:01:22 Assert.IsTrue failed.
OfficeDevPnP.Core.Tests.Framework.Functional.TermGroupNoScriptTests.SiteCollectionTermGroupTest 00:01:41 Assert.IsTrue failed.
OfficeDevPnP.Core.Tests.Framework.Functional.NavigationTests.SiteCollectionNavigationTest 00:02:49 Test method OfficeDevPnP.Core.Tests.Framework.Functional.NavigationTests.SiteCollectionNavigationTest threw exception: Microsoft.SharePoint.Client.ServerException: The HTTP service located at http://usr187106-157:32843/5b7f4e1d790f4ce393746fdf32ca2f91/MetadataWebService.svc is unavailable. This could be because the service is too busy or because no endpoint was found listening at the specified address. Please ensure that the address is correct and try accessing the service again later.
OfficeDevPnP.Core.Tests.Framework.ObjectHandlers.ObjectSiteSecurityTests.CanProvisionAssociatedGroupsInSubSite 00:00:12 Test method OfficeDevPnP.Core.Tests.Framework.ObjectHandlers.ObjectSiteSecurityTests.CanProvisionAssociatedGroupsInSubSite threw exception: System.InvalidOperationException: Nullable object must have a value.
OfficeDevPnP.Core.Tests.Framework.ObjectHandlers.ObjectTermGroupsTests.CanProvisionReusableTerms 00:00:09 Assert.IsTrue failed.
Page 1 of 2

Notfound tests
Result Test Duration Error
No data found