Test run details - MTFirstReleaseCredentials - 3/10/2019 6:45:04 PM

Failed Tests | Skipped Tests | Notfound Tests | Passed Tests

Failed tests
Result Test      Search Duration Error
OfficeDevPnP.Core.Tests.Sites.ALMTests.DeployRetractAppAsyncTest 00:00:01 Test method OfficeDevPnP.Core.Tests.Sites.ALMTests.DeployRetractAppAsyncTest threw exception: System.Exception: {"error":{"code":"-1, Microsoft.SharePoint.Client.ResourceNotFoundException","message":{"lang":"en-US","value":"Exception of type 'Microsoft.SharePoint.Client.ResourceNotFoundException' was thrown."}}}
OfficeDevPnP.Core.Tests.Sites.ALMTests.DeployRetractAppTest 00:00:02 Test method OfficeDevPnP.Core.Tests.Sites.ALMTests.DeployRetractAppTest threw exception: System.Exception: {"error":{"code":"-1, Microsoft.SharePoint.Client.ResourceNotFoundException","message":{"lang":"en-US","value":"Exception of type 'Microsoft.SharePoint.Client.ResourceNotFoundException' was thrown."}}}
OfficeDevPnP.Core.Tests.AppModelExtensions.NavigationExtensionsTests.DeleteSearchNavigationNodeTest 00:00:01 Test method OfficeDevPnP.Core.Tests.AppModelExtensions.NavigationExtensionsTests.DeleteSearchNavigationNodeTest threw exception: System.InvalidOperationException: Sequence contains more than one matching element
OfficeDevPnP.Core.Tests.AppModelExtensions.NavigationExtensionsTests.DeleteTopNavigationNodeTest 00:00:00 Test method OfficeDevPnP.Core.Tests.AppModelExtensions.NavigationExtensionsTests.DeleteTopNavigationNodeTest threw exception: System.InvalidOperationException: Sequence contains more than one matching element
OfficeDevPnP.Core.Tests.Framework.Functional.WorkflowsTests.SiteCollectionWorkflowsTest 00:00:25 Test method OfficeDevPnP.Core.Tests.Framework.Functional.WorkflowsTests.SiteCollectionWorkflowsTest threw exception: System.Exception: Referenced content type 0x0108003365C4474CAE8C42BCE396314E88E51F not available in site or in template
OfficeDevPnP.Core.Tests.Framework.Functional.WorkflowsNoScriptTests.SiteCollectionWorkflowsTest 00:00:22 Test method OfficeDevPnP.Core.Tests.Framework.Functional.WorkflowsNoScriptTests.SiteCollectionWorkflowsTest threw exception: System.Exception: Referenced content type 0x0108003365C4474CAE8C42BCE396314E88E51F not available in site or in template
OfficeDevPnP.Core.Tests.Framework.Functional.WebSettingsTests.WebWebSettingsTest N/A Class Initialization method OfficeDevPnP.Core.Tests.Framework.Functional.WebSettingsTests.ClassInit threw exception. System.Threading.ThreadAbortException: System.Threading.ThreadAbortException: Thread was being aborted..
OfficeDevPnP.Core.Tests.Framework.Functional.WebSettingsTests.SiteCollectionAuditSettingsTest N/A Class Initialization method OfficeDevPnP.Core.Tests.Framework.Functional.WebSettingsTests.ClassInit threw exception. System.Threading.ThreadAbortException: System.Threading.ThreadAbortException: Thread was being aborted..
OfficeDevPnP.Core.Tests.Framework.Functional.WebSettingsTests.SiteCollectionWebSettingsTest N/A Test 'SiteCollectionWebSettingsTest' exceeded execution timeout period.
OfficeDevPnP.Core.Tests.Framework.Functional.TermGroupTests.WebTermGroupTest 00:01:36 Assert.IsTrue failed.
Page 1 of 2

Notfound tests
Result Test Duration Error
No data found