Test run details - MTFirstReleaseCredentials - 3/9/2019 6:45:04 PM

Failed Tests | Skipped Tests | Notfound Tests | Passed Tests

Failed tests
Result Test      Search Duration Error
OfficeDevPnP.Core.Tests.Sites.ALMTests.DeployRetractAppAsyncTest 00:00:02 Test method OfficeDevPnP.Core.Tests.Sites.ALMTests.DeployRetractAppAsyncTest threw exception: System.Exception: {"error":{"code":"-1, Microsoft.SharePoint.Client.ResourceNotFoundException","message":{"lang":"en-US","value":"Exception of type 'Microsoft.SharePoint.Client.ResourceNotFoundException' was thrown."}}}
OfficeDevPnP.Core.Tests.Sites.ALMTests.DeployRetractAppTest 00:00:01 Test method OfficeDevPnP.Core.Tests.Sites.ALMTests.DeployRetractAppTest threw exception: System.Exception: {"error":{"code":"-1, Microsoft.SharePoint.Client.ResourceNotFoundException","message":{"lang":"en-US","value":"Exception of type 'Microsoft.SharePoint.Client.ResourceNotFoundException' was thrown."}}}
OfficeDevPnP.Core.Tests.AppModelExtensions.NavigationExtensionsTests.DeleteSearchNavigationNodeTest 00:00:01 Test method OfficeDevPnP.Core.Tests.AppModelExtensions.NavigationExtensionsTests.DeleteSearchNavigationNodeTest threw exception: System.InvalidOperationException: Sequence contains more than one matching element
OfficeDevPnP.Core.Tests.AppModelExtensions.NavigationExtensionsTests.DeleteTopNavigationNodeTest 00:00:00 Test method OfficeDevPnP.Core.Tests.AppModelExtensions.NavigationExtensionsTests.DeleteTopNavigationNodeTest threw exception: System.InvalidOperationException: Sequence contains more than one matching element
OfficeDevPnP.Core.Tests.Framework.Functional.TermGroupTests.WebTermGroupTest 00:01:33 Assert.IsTrue failed.
OfficeDevPnP.Core.Tests.Framework.Functional.TermGroupTests.SiteCollectionTermGroupTest 00:01:54 Assert.IsTrue failed.
OfficeDevPnP.Core.Tests.Framework.Functional.TermGroupNoScriptTests.WebTermGroupTest 00:01:30 Assert.IsTrue failed.
OfficeDevPnP.Core.Tests.Framework.Functional.TermGroupNoScriptTests.SiteCollectionTermGroupTest 00:01:48 Assert.IsTrue failed.
OfficeDevPnP.Core.Tests.Framework.ObjectHandlers.ObjectTermGroupsTests.CanProvisionReusableTerms 00:00:09 Assert.IsTrue failed.
OfficeDevPnP.Core.Tests.Framework.ObjectHandlers.ObjectTermGroupsTests.CanProvisionObjects 00:00:04 Test method OfficeDevPnP.Core.Tests.Framework.ObjectHandlers.ObjectTermGroupsTests.CanProvisionObjects threw exception: Microsoft.SharePoint.Client.CollectionNotInitializedException: The collection has not been initialized. It has not been requested or the request has not been executed. It may need to be explicitly requested.
Page 1 of 2

Notfound tests
Result Test Duration Error
No data found