Test run details - MTFirstReleaseCredentials - 1/9/2019 6:45:06 PM

Failed Tests | Skipped Tests | Notfound Tests | Passed Tests

Failed tests
Result Test      Search Duration Error
OfficeDevPnP.Core.Tests.AppModelExtensions.NavigationExtensionsTests.DeleteSearchNavigationNodeTest 00:00:01 Test method OfficeDevPnP.Core.Tests.AppModelExtensions.NavigationExtensionsTests.DeleteSearchNavigationNodeTest threw exception: System.InvalidOperationException: Sequence contains more than one matching element
OfficeDevPnP.Core.Tests.AppModelExtensions.NavigationExtensionsTests.DeleteTopNavigationNodeTest 00:00:00 Test method OfficeDevPnP.Core.Tests.AppModelExtensions.NavigationExtensionsTests.DeleteTopNavigationNodeTest threw exception: System.InvalidOperationException: Sequence contains more than one matching element
OfficeDevPnP.Core.Tests.Framework.Functional.PropertyBagTests.WebPropertyBagAddingTest N/A Class Initialization method OfficeDevPnP.Core.Tests.Framework.Functional.PropertyBagTests.ClassInit threw exception. System.Threading.ThreadAbortException: System.Threading.ThreadAbortException: Thread was being aborted..
OfficeDevPnP.Core.Tests.Framework.Functional.PropertyBagTests.SiteCollectionPropertyBagAddingTest N/A Test 'SiteCollectionPropertyBagAddingTest' exceeded execution timeout period.
OfficeDevPnP.Core.Tests.Framework.Functional.WebSettingsTests.WebWebSettingsTest N/A Class Initialization method OfficeDevPnP.Core.Tests.Framework.Functional.WebSettingsTests.ClassInit threw exception. System.Threading.ThreadAbortException: System.Threading.ThreadAbortException: Thread was being aborted..
OfficeDevPnP.Core.Tests.Framework.Functional.WebSettingsTests.SiteCollectionAuditSettingsTest N/A Class Initialization method OfficeDevPnP.Core.Tests.Framework.Functional.WebSettingsTests.ClassInit threw exception. System.Threading.ThreadAbortException: System.Threading.ThreadAbortException: Thread was being aborted..
OfficeDevPnP.Core.Tests.Framework.Functional.WebSettingsTests.SiteCollectionWebSettingsTest N/A Test 'SiteCollectionWebSettingsTest' exceeded execution timeout period.
OfficeDevPnP.Core.Tests.Framework.Functional.TermGroupTests.WebTermGroupTest 00:01:26 Assert.IsTrue failed.
OfficeDevPnP.Core.Tests.Framework.Functional.TermGroupTests.SiteCollectionTermGroupTest 00:01:47 Assert.IsTrue failed.
OfficeDevPnP.Core.Tests.Framework.Functional.TermGroupNoScriptTests.WebTermGroupTest N/A Class Initialization method OfficeDevPnP.Core.Tests.Framework.Functional.TermGroupNoScriptTests.ClassInit threw exception. System.Threading.ThreadAbortException: System.Threading.ThreadAbortException: Thread was being aborted..
Page 1 of 2

Notfound tests
Result Test Duration Error
No data found