Test run details - MTFirstReleaseAppOnly - 1/6/2019 12:06:27 AM

Failed Tests | Skipped Tests | Notfound Tests | Passed Tests

Failed tests
Result Test      Search Duration Error
OfficeDevPnP.Core.Tests.AppModelExtensions.NavigationExtensionsTests.DeleteSearchNavigationNodeTest 00:00:02 Test method OfficeDevPnP.Core.Tests.AppModelExtensions.NavigationExtensionsTests.DeleteSearchNavigationNodeTest threw exception: System.InvalidOperationException: Sequence contains more than one matching element
OfficeDevPnP.Core.Tests.AppModelExtensions.NavigationExtensionsTests.DeleteTopNavigationNodeTest 00:00:01 Test method OfficeDevPnP.Core.Tests.AppModelExtensions.NavigationExtensionsTests.DeleteTopNavigationNodeTest threw exception: System.InvalidOperationException: Sequence contains more than one matching element
OfficeDevPnP.Core.Tests.Framework.ObjectHandlers.ObjectPagesTests.CanProvisionObjects 00:00:10 Test method OfficeDevPnP.Core.Tests.Framework.ObjectHandlers.ObjectPagesTests.CanProvisionObjects threw exception: Microsoft.SharePoint.Client.ServerException: File Not Found.
OfficeDevPnP.Core.Tests.Framework.Providers.XMLProvidersTests.XMLSerializer_Deserialize_UnavailableExtensibilityHandlersThrowsException_201512 00:00:00 Test method OfficeDevPnP.Core.Tests.Framework.Providers.XMLProvidersTests.XMLSerializer_Deserialize_UnavailableExtensibilityHandlersThrowsException_201512 did not throw an exception. An exception was expected by attribute Microsoft.VisualStudio.TestTools.UnitTesting.ExpectedExceptionAttribute defined on the test method.
OfficeDevPnP.Core.Tests.Framework.Providers.XMLProvidersTests.XMLSerializer_Deserialize_UnavailableExtensibilityHandlersThrowsException_201605 00:00:00 Test method OfficeDevPnP.Core.Tests.Framework.Providers.XMLProvidersTests.XMLSerializer_Deserialize_UnavailableExtensibilityHandlersThrowsException_201605 did not throw an exception. An exception was expected by attribute Microsoft.VisualStudio.TestTools.UnitTesting.ExpectedExceptionAttribute defined on the test method.
OfficeDevPnP.Core.Tests.Framework.ProvisioningTemplates.ProvisioningTests.ProvisionTenantTemplate 00:00:01 Test method OfficeDevPnP.Core.Tests.Framework.ProvisioningTemplates.ProvisioningTests.ProvisionTenantTemplate threw exception: System.Net.WebException: The remote server returned an error: (401) Unauthorized.
Page 1 of 1

Skipped tests
Result Test      Search Duration Error
OfficeDevPnP.Core.Tests.Sites.SiteCollectionTests.CreateCommunicationSiteTestAsync 00:00:00 Assert.Inconclusive failed. Test that require modern site collection creation are not supported in app-only.
OfficeDevPnP.Core.Tests.AppModelExtensions.TenantExtensionsTests.GetUserProfileServiceClientTest 00:00:00 Assert.Inconclusive failed. Web service tests are not supported when testing using app-only
OfficeDevPnP.Core.Tests.AppModelExtensions.TenantExtensionsTests.GetOneDriveSiteCollectionsTest 00:00:00 Assert.Inconclusive failed. Web service tests are not supported when testing using app-only
OfficeDevPnP.Core.Tests.AppModelExtensions.FileFolderExtensionsTests.UploadFileWebDavTest 00:00:03 Assert.Inconclusive failed. Tests involving webdav are not supported when testing using app-only
OfficeDevPnP.Core.Tests.AppModelExtensions.SearchExtensionsTests.TestSiteSearchTest 00:00:00 Assert.Inconclusive failed. Search tests are not supported when testing using app-only
OfficeDevPnP.Core.Tests.AppModelExtensions.SearchExtensionsTests.GetSearchConfigurationFromSiteTest 00:00:00 Assert.Inconclusive failed. Search tests are not supported when testing using app-only
OfficeDevPnP.Core.Tests.AppModelExtensions.SearchExtensionsTests.GetSearchConfigurationFromWebTest 00:00:00 Assert.Inconclusive failed. Search tests are not supported when testing using app-only
OfficeDevPnP.Core.Tests.AppModelExtensions.SearchExtensionsTests.SetSiteCollectionSearchCenterUrlTest 00:00:00 Assert.Inconclusive failed. Search tests are not supported when testing using app-only
OfficeDevPnP.Core.Tests.Framework.Functional.SearchSettingTests.Web1605SearchSettingsTest 00:00:00 Assert.Inconclusive failed. Test that require search settings are not supported in app-only.
OfficeDevPnP.Core.Tests.Framework.Functional.SearchSettingTests.SiteCollection1605SearchSettingsTest 00:00:00 Assert.Inconclusive failed. Test that require search settings are not supported in app-only.
Page 1 of 7

Notfound tests
Result Test Duration Error
No data found