Test run details - AzureVMSP2013AppOnly - 12/5/2018 7:34:58 PM

Failed Tests | Skipped Tests | Notfound Tests | Passed Tests

Failed tests
Result Test      Search Duration Error
OfficeDevPnP.Core.Tests.AppModelExtensions.Tenant15ExtensionsTests.CreateDeleteSiteCollectionTest 00:00:00 Test method OfficeDevPnP.Core.Tests.AppModelExtensions.Tenant15ExtensionsTests.CreateDeleteSiteCollectionTest threw exception: Microsoft.SharePoint.Client.ServerException: The content database SP2013_Content_Portal in this cluster are full. You cannot add more Web sites until you change the content database Web site capacity settings or add more content databases.
OfficeDevPnP.Core.Tests.Framework.ExtensibilityCallOut.ExtensibilityTests.TokenProviderCanBeDisabled 00:00:00 Test method OfficeDevPnP.Core.Tests.Framework.ExtensibilityCallOut.ExtensibilityTests.TokenProviderCanBeDisabled threw exception: Microsoft.SharePoint.Client.ServerUnauthorizedAccessException: Access denied. You do not have permission to perform this action or access this resource.
OfficeDevPnP.Core.Tests.Framework.ExtensibilityCallOut.ExtensibilityTests.TokenProviderProvidesTokens 00:00:00 Test method OfficeDevPnP.Core.Tests.Framework.ExtensibilityCallOut.ExtensibilityTests.TokenProviderProvidesTokens threw exception: Microsoft.SharePoint.Client.ServerUnauthorizedAccessException: Access denied. You do not have permission to perform this action or access this resource.
OfficeDevPnP.Core.Tests.Framework.ExtensibilityCallOut.ExtensibilityTests.TokenProviderReceivesExpectedParameters 00:00:00 Test method OfficeDevPnP.Core.Tests.Framework.ExtensibilityCallOut.ExtensibilityTests.TokenProviderReceivesExpectedParameters threw exception: Microsoft.SharePoint.Client.ServerUnauthorizedAccessException: Access denied. You do not have permission to perform this action or access this resource.
OfficeDevPnP.Core.Tests.Framework.Functional.PropertyBagTests.WebPropertyBagAddingTest N/A Class Initialization method OfficeDevPnP.Core.Tests.Framework.Functional.PropertyBagTests.ClassInit threw exception. Microsoft.SharePoint.Client.ServerException: Microsoft.SharePoint.Client.ServerException: The content database SP2013_Content_Portal in this cluster are full. You cannot add more Web sites until you change the content database Web site capacity settings or add more content databases..
OfficeDevPnP.Core.Tests.Framework.Functional.PropertyBagTests.SiteCollectionPropertyBagAddingTest N/A Class Initialization method OfficeDevPnP.Core.Tests.Framework.Functional.PropertyBagTests.ClassInit threw exception. Microsoft.SharePoint.Client.ServerException: Microsoft.SharePoint.Client.ServerException: The content database SP2013_Content_Portal in this cluster are full. You cannot add more Web sites until you change the content database Web site capacity settings or add more content databases..
OfficeDevPnP.Core.Tests.Framework.Functional.SearchSettingTests.Web1605SearchSettingsTest N/A Class Initialization method OfficeDevPnP.Core.Tests.Framework.Functional.SearchSettingTests.ClassInit threw exception. Microsoft.SharePoint.Client.ServerException: Microsoft.SharePoint.Client.ServerException: The content database SP2013_Content_Portal in this cluster are full. You cannot add more Web sites until you change the content database Web site capacity settings or add more content databases..
OfficeDevPnP.Core.Tests.Framework.Functional.SearchSettingTests.SiteCollection1605SearchSettingsTest N/A Class Initialization method OfficeDevPnP.Core.Tests.Framework.Functional.SearchSettingTests.ClassInit threw exception. Microsoft.SharePoint.Client.ServerException: Microsoft.SharePoint.Client.ServerException: The content database SP2013_Content_Portal in this cluster are full. You cannot add more Web sites until you change the content database Web site capacity settings or add more content databases..
OfficeDevPnP.Core.Tests.Framework.Functional.RegionalSettingsTests.WebRegionalSettingsTest N/A Class Initialization method OfficeDevPnP.Core.Tests.Framework.Functional.RegionalSettingsTests.ClassInit threw exception. Microsoft.SharePoint.Client.ServerException: Microsoft.SharePoint.Client.ServerException: The content database SP2013_Content_Portal in this cluster are full. You cannot add more Web sites until you change the content database Web site capacity settings or add more content databases..
OfficeDevPnP.Core.Tests.Framework.Functional.RegionalSettingsTests.SiteCollectionRegionalSettingsTest N/A Class Initialization method OfficeDevPnP.Core.Tests.Framework.Functional.RegionalSettingsTests.ClassInit threw exception. Microsoft.SharePoint.Client.ServerException: Microsoft.SharePoint.Client.ServerException: The content database SP2013_Content_Portal in this cluster are full. You cannot add more Web sites until you change the content database Web site capacity settings or add more content databases..

Skipped tests
Result Test      Search Duration Error
OfficeDevPnP.Core.Tests.Authentication.HighTrustAuthenticationTests.CertificateFromStoreAppOnlyAuthenticationTest 00:00:00 Assert.Inconclusive failed. Not enough information to execute this test is passed via the app.config file.
OfficeDevPnP.Core.Tests.Authentication.HighTrustAuthenticationTests.CertificateFileAppOnlyAuthenticationTest 00:00:00 Assert.Inconclusive failed. Not enough information to execute this test is passed via the app.config file.
OfficeDevPnP.Core.Tests.AppModelExtensions.FileFolderExtensionsTests.UploadFileWebDavTest 00:00:00 Assert.Inconclusive failed. Tests involving webdav are not supported when testing using app-only
OfficeDevPnP.Core.Tests.AppModelExtensions.SearchExtensionsTests.TestSiteSearchTest 00:00:00 Assert.Inconclusive failed. Search tests are not supported when testing using app-only
OfficeDevPnP.Core.Tests.AppModelExtensions.SearchExtensionsTests.GetSearchConfigurationFromSiteTest 00:00:00 Assert.Inconclusive failed. Search tests are not supported when testing using app-only
OfficeDevPnP.Core.Tests.AppModelExtensions.SearchExtensionsTests.GetSearchConfigurationFromWebTest 00:00:00 Assert.Inconclusive failed. Search tests are not supported when testing using app-only
OfficeDevPnP.Core.Tests.AppModelExtensions.SearchExtensionsTests.SetSiteCollectionSearchCenterUrlTest 00:00:00 Assert.Inconclusive failed. Search tests are not supported when testing using app-only
OfficeDevPnP.Core.Tests.Framework.Connectors.ConnectorAzureTests.AzureConnectorBackslashSupportTest 00:00:00 Assert.Inconclusive failed. No Azure Storage Key defined in App.Config, so can't test
OfficeDevPnP.Core.Tests.Framework.Connectors.ConnectorAzureTests.AzureConnectorDelete2FolderTest 00:00:00 Assert.Inconclusive failed. No Azure Storage Key defined in App.Config, so can't test
OfficeDevPnP.Core.Tests.Framework.Connectors.ConnectorAzureTests.AzureConnectorDelete2Test 00:00:00 Assert.Inconclusive failed. No Azure Storage Key defined in App.Config, so can't test
Page 1 of 7

Notfound tests
Result Test Duration Error
No data found