Test run details - MTFirstReleaseCredentials - 12/5/2018 6:45:05 PM

Failed Tests | Skipped Tests | Notfound Tests | Passed Tests

Failed tests
Result Test      Search Duration Error
OfficeDevPnP.Core.Tests.Sites.SiteCollectionTests.CreateCommunicationSiteTestAsync 00:00:00 Test method OfficeDevPnP.Core.Tests.Sites.SiteCollectionTests.CreateCommunicationSiteTestAsync threw exception: Microsoft.SharePoint.Client.IdcrlException: The sign-in name or password does not match one in the Microsoft account system. TestCleanup method OfficeDevPnP.Core.Tests.Sites.SiteCollectionTests.CleanUp threw exception. Microsoft.SharePoint.Client.IdcrlException: Microsoft.SharePoint.Client.IdcrlException: The sign-in name or password does not match one in the Microsoft account system..
OfficeDevPnP.Core.Tests.Sites.ALMTests.DeployRetractAppAsyncTest 00:00:00 Test method OfficeDevPnP.Core.Tests.Sites.ALMTests.DeployRetractAppAsyncTest threw exception: Microsoft.SharePoint.Client.IdcrlException: The sign-in name or password does not match one in the Microsoft account system.
OfficeDevPnP.Core.Tests.Sites.ALMTests.DeployRetractAppTest 00:00:00 Test method OfficeDevPnP.Core.Tests.Sites.ALMTests.DeployRetractAppTest threw exception: Microsoft.SharePoint.Client.IdcrlException: The sign-in name or password does not match one in the Microsoft account system.
OfficeDevPnP.Core.Tests.Sites.ALMTests.AddRemoveAppTest 00:00:00 Test method OfficeDevPnP.Core.Tests.Sites.ALMTests.AddRemoveAppTest threw exception: Microsoft.SharePoint.Client.IdcrlException: The sign-in name or password does not match one in the Microsoft account system.
OfficeDevPnP.Core.Tests.Sites.ALMTests.AddRemoveAppTestAsync 00:00:00 Test method OfficeDevPnP.Core.Tests.Sites.ALMTests.AddRemoveAppTestAsync threw exception: Microsoft.SharePoint.Client.IdcrlException: The sign-in name or password does not match one in the Microsoft account system.
OfficeDevPnP.Core.Tests.Sites.ALMTests.GetAvailable 00:00:00 Test method OfficeDevPnP.Core.Tests.Sites.ALMTests.GetAvailable threw exception: Microsoft.SharePoint.Client.IdcrlException: The sign-in name or password does not match one in the Microsoft account system.
OfficeDevPnP.Core.Tests.Sites.ALMTests.GetAvailableTestAsync 00:00:00 Test method OfficeDevPnP.Core.Tests.Sites.ALMTests.GetAvailableTestAsync threw exception: Microsoft.SharePoint.Client.IdcrlException: The sign-in name or password does not match one in the Microsoft account system.
OfficeDevPnP.Core.Tests.Authentication.AuthenticationTests.AzureADAuthFullControlPermissionTest N/A Class Initialization method OfficeDevPnP.Core.Tests.Authentication.AuthenticationTests.ClassInit threw exception. Microsoft.SharePoint.Client.IdcrlException: Microsoft.SharePoint.Client.IdcrlException: The sign-in name or password does not match one in the Microsoft account system..
OfficeDevPnP.Core.Tests.AppModelExtensions.PageExtensionsTests.CreatedPublishingPagesSetsTitleCorrectlyTest 00:00:00 Test method OfficeDevPnP.Core.Tests.AppModelExtensions.PageExtensionsTests.CreatedPublishingPagesSetsTitleCorrectlyTest threw exception: Microsoft.SharePoint.Client.IdcrlException: The sign-in name or password does not match one in the Microsoft account system.
OfficeDevPnP.Core.Tests.AppModelExtensions.PageExtensionsTests.CanCreatePublishedPublishingPageWhenModerationIsDisabledTest 00:00:00 Test method OfficeDevPnP.Core.Tests.AppModelExtensions.PageExtensionsTests.CanCreatePublishedPublishingPageWhenModerationIsDisabledTest threw exception: Microsoft.SharePoint.Client.IdcrlException: The sign-in name or password does not match one in the Microsoft account system.

Notfound tests
Result Test Duration Error
No data found