Test run details - MTFirstReleaseCredentials - 11/7/2018 6:45:06 PM

Failed Tests | Skipped Tests | Notfound Tests | Passed Tests

Failed tests
Result Test      Search Duration Error
OfficeDevPnP.Core.Tests.AppModelExtensions.NavigationExtensionsTests.DeleteSearchNavigationNodeTest 00:00:01 Test method OfficeDevPnP.Core.Tests.AppModelExtensions.NavigationExtensionsTests.DeleteSearchNavigationNodeTest threw exception: System.InvalidOperationException: Sequence contains more than one matching element
OfficeDevPnP.Core.Tests.AppModelExtensions.NavigationExtensionsTests.DeleteTopNavigationNodeTest 00:00:00 Test method OfficeDevPnP.Core.Tests.AppModelExtensions.NavigationExtensionsTests.DeleteTopNavigationNodeTest threw exception: System.InvalidOperationException: Sequence contains more than one matching element
OfficeDevPnP.Core.Tests.Framework.Functional.TermGroupTests.WebTermGroupTest 00:01:22 Assert.IsTrue failed.
OfficeDevPnP.Core.Tests.Framework.Functional.TermGroupTests.SiteCollectionTermGroupTest 00:01:40 Assert.IsTrue failed.
OfficeDevPnP.Core.Tests.Framework.Functional.TermGroupNoScriptTests.WebTermGroupTest 00:01:23 Assert.IsTrue failed.
OfficeDevPnP.Core.Tests.Framework.Functional.TermGroupNoScriptTests.SiteCollectionTermGroupTest 00:01:44 Assert.IsTrue failed.
OfficeDevPnP.Core.Tests.Framework.Functional.ListTests.Web1605ListAddingTest 00:01:12 Assert.IsTrue failed.
OfficeDevPnP.Core.Tests.Framework.Functional.ListTests.SiteCollection1605ListAddingTest 00:01:26 Assert.IsTrue failed.
OfficeDevPnP.Core.Tests.Framework.ObjectHandlers.TokenParserTests.ParseTests 00:00:12 Assert.IsTrue failed.
OfficeDevPnP.Core.Tests.Framework.ObjectHandlers.ObjectListInstanceTests.UpdatedListTitleShouldBeAvailableAsToken 00:00:10 Test method OfficeDevPnP.Core.Tests.Framework.ObjectHandlers.ObjectListInstanceTests.UpdatedListTitleShouldBeAvailableAsToken threw exception: Microsoft.SharePoint.Client.ServerException: List 'Test_636772149187422842' does not exist at site with URL 'https://bertonline.sharepoint.com/sites/pnptest2'.
Page 1 of 2

Notfound tests
Result Test Duration Error
No data found