Test run details - AzureVMSP2013Credentials - 10/10/2018 6:15:14 PM

Failed Tests | Skipped Tests | Notfound Tests | Passed Tests

Failed tests
Result Test      Search Duration Error
OfficeDevPnP.Core.Tests.AppModelExtensions.Tenant15ExtensionsTests.CreateDeleteSiteCollectionTest 00:00:00 Test method OfficeDevPnP.Core.Tests.AppModelExtensions.Tenant15ExtensionsTests.CreateDeleteSiteCollectionTest threw exception: Microsoft.SharePoint.Client.ServerException: Another site already exists at https://portal2013.pnp.com/sites/TestPnPSC_123456789. Delete this site before attempting to create a new site with the same URL, choose a new URL, or create a new inclusion at the path you originally specified.
OfficeDevPnP.Core.Tests.Framework.Functional.TermGroupTests.WebTermGroupTest 00:12:39 Assert.IsTrue failed.
OfficeDevPnP.Core.Tests.Framework.Functional.TermGroupTests.SiteCollectionTermGroupTest 00:12:49 Assert.IsTrue failed.
OfficeDevPnP.Core.Tests.Framework.Functional.ListTests.Web1605ListAddingTest 00:00:26 Assert.IsTrue failed.
OfficeDevPnP.Core.Tests.Framework.Functional.ListTests.SiteCollection1605ListAddingTest 00:00:31 Assert.IsTrue failed.
OfficeDevPnP.Core.Tests.Framework.ObjectHandlers.TokenParserTests.ParseTests 00:00:04 Assert.IsTrue failed.
OfficeDevPnP.Core.Tests.Framework.ObjectHandlers.ObjectWorkflowsTests.UpdatWorkflowSubscription 00:00:02 Test method OfficeDevPnP.Core.Tests.Framework.ObjectHandlers.ObjectWorkflowsTests.UpdatWorkflowSubscription threw exception: Microsoft.SharePoint.Client.ServerException: Cannot invoke method or retrieve property from null object. Object returned by the following call stack is null. "GetWorkflowDeploymentService new Microsoft.SharePoint.WorkflowServices.WorkflowServicesManager() "
OfficeDevPnP.Core.Tests.Framework.ObjectHandlers.ObjectListInstanceTests.UpdatedListTitleShouldBeAvailableAsToken 00:00:04 Test method OfficeDevPnP.Core.Tests.Framework.ObjectHandlers.ObjectListInstanceTests.UpdatedListTitleShouldBeAvailableAsToken threw exception: Microsoft.SharePoint.Client.ServerException: List 'Test_636747942274863279' does not exist at site with URL 'https://portal2013.pnp.com/sites/pnptest2'.
OfficeDevPnP.Core.Tests.Framework.ObjectHandlers.ObjectPagesTests.CanProvisionObjects 00:00:05 Test method OfficeDevPnP.Core.Tests.Framework.ObjectHandlers.ObjectPagesTests.CanProvisionObjects threw exception: Microsoft.SharePoint.Client.ServerException: The file or folder name contains characters that are not permitted. Please use a different name.
OfficeDevPnP.Core.Tests.Framework.ObjectHandlers.ObjectTermGroupsTests.CanProvisionReusableTerms 00:00:04 Assert.IsTrue failed.
Page 1 of 2

Skipped tests
Result Test      Search Duration Error
OfficeDevPnP.Core.Tests.Authentication.HighTrustAuthenticationTests.CertificateFromStoreAppOnlyAuthenticationTest 00:00:00 Assert.Inconclusive failed. Not enough information to execute this test is passed via the app.config file.
OfficeDevPnP.Core.Tests.Authentication.HighTrustAuthenticationTests.CertificateFileAppOnlyAuthenticationTest 00:00:00 Assert.Inconclusive failed. Not enough information to execute this test is passed via the app.config file.
OfficeDevPnP.Core.Tests.Framework.Connectors.ConnectorAzureTests.AzureConnectorBackslashSupportTest 00:00:00 Assert.Inconclusive failed. No Azure Storage Key defined in App.Config, so can't test
OfficeDevPnP.Core.Tests.Framework.Connectors.ConnectorAzureTests.AzureConnectorDelete2FolderTest 00:00:00 Assert.Inconclusive failed. No Azure Storage Key defined in App.Config, so can't test
OfficeDevPnP.Core.Tests.Framework.Connectors.ConnectorAzureTests.AzureConnectorDelete2Test 00:00:00 Assert.Inconclusive failed. No Azure Storage Key defined in App.Config, so can't test
OfficeDevPnP.Core.Tests.Framework.Connectors.ConnectorAzureTests.AzureConnectorDelete1Test 00:00:00 Assert.Inconclusive failed. No Azure Storage Key defined in App.Config, so can't test
OfficeDevPnP.Core.Tests.Framework.Connectors.ConnectorAzureTests.AzureConnectorSaveStream3Test 00:00:00 Assert.Inconclusive failed. No Azure Storage Key defined in App.Config, so can't test
OfficeDevPnP.Core.Tests.Framework.Connectors.ConnectorAzureTests.AzureConnectorSaveStream2Folder2Test 00:00:00 Assert.Inconclusive failed. No Azure Storage Key defined in App.Config, so can't test
OfficeDevPnP.Core.Tests.Framework.Connectors.ConnectorAzureTests.AzureConnectorSaveStream2FolderTest 00:00:00 Assert.Inconclusive failed. No Azure Storage Key defined in App.Config, so can't test
OfficeDevPnP.Core.Tests.Framework.Connectors.ConnectorAzureTests.AzureConnectorSaveStream2Test 00:00:00 Assert.Inconclusive failed. No Azure Storage Key defined in App.Config, so can't test
Page 1 of 3

Notfound tests
Result Test Duration Error
No data found