Test run details - MTFirstReleaseCredentials - 10/9/2018 6:45:41 PM

Failed Tests | Skipped Tests | Notfound Tests | Passed Tests

Failed tests
Result Test      Search Duration Error
OfficeDevPnP.Core.Tests.AppModelExtensions.NavigationExtensionsTests.DeleteSearchNavigationNodeTest 00:00:00 Test method OfficeDevPnP.Core.Tests.AppModelExtensions.NavigationExtensionsTests.DeleteSearchNavigationNodeTest threw exception: System.InvalidOperationException: Sequence contains more than one matching element
OfficeDevPnP.Core.Tests.AppModelExtensions.NavigationExtensionsTests.DeleteTopNavigationNodeTest 00:00:00 Test method OfficeDevPnP.Core.Tests.AppModelExtensions.NavigationExtensionsTests.DeleteTopNavigationNodeTest threw exception: System.InvalidOperationException: Sequence contains more than one matching element
OfficeDevPnP.Core.Tests.Framework.Functional.TermGroupTests.WebTermGroupTest 00:01:21 Assert.IsTrue failed.
OfficeDevPnP.Core.Tests.Framework.Functional.TermGroupTests.SiteCollectionTermGroupTest 00:01:38 Assert.IsTrue failed.
OfficeDevPnP.Core.Tests.Framework.Functional.TermGroupNoScriptTests.WebTermGroupTest 00:01:21 Assert.IsTrue failed.
OfficeDevPnP.Core.Tests.Framework.Functional.TermGroupNoScriptTests.SiteCollectionTermGroupTest 00:01:39 Assert.IsTrue failed.
OfficeDevPnP.Core.Tests.Framework.Functional.SecurityTests.SiteCollectionSecurityTest 00:00:14 Test method OfficeDevPnP.Core.Tests.Framework.Functional.SecurityTests.SiteCollectionSecurityTest threw exception: Microsoft.SharePoint.Client.ServerException: The HTTP service located at http://usr187106-704:32843/5b7f4e1d790f4ce393746fdf32ca2f91/MetadataWebService.svc is unavailable. This could be because the service is too busy or because no endpoint was found listening at the specified address. Please ensure that the address is correct and try accessing the service again later.
OfficeDevPnP.Core.Tests.Framework.Functional.SecurityNoScriptTests.SiteCollectionSecurityTest N/A Test 'SiteCollectionSecurityTest' exceeded execution timeout period.
OfficeDevPnP.Core.Tests.Framework.Functional.PropertyBagNoScriptTests.WebPropertyBagAddingTest N/A Class Initialization method OfficeDevPnP.Core.Tests.Framework.Functional.PropertyBagNoScriptTests.ClassInit threw exception. System.Threading.ThreadAbortException: System.Threading.ThreadAbortException: Thread was being aborted..
OfficeDevPnP.Core.Tests.Framework.Functional.PropertyBagNoScriptTests.SiteCollectionPropertyBagAddingTest N/A Test 'SiteCollectionPropertyBagAddingTest' exceeded execution timeout period.
Page 1 of 5

Notfound tests
Result Test Duration Error
No data found