Test run details - MTFirstReleaseCredentials - 9/13/2018 6:45:06 PM

Failed Tests | Skipped Tests | Notfound Tests | Passed Tests

Failed tests
Result Test      Search Duration Error
OfficeDevPnP.Core.Tests.AppModelExtensions.NavigationExtensionsTests.DeleteSearchNavigationNodeTest 00:00:00 Test method OfficeDevPnP.Core.Tests.AppModelExtensions.NavigationExtensionsTests.DeleteSearchNavigationNodeTest threw exception: System.InvalidOperationException: Sequence contains more than one matching element
OfficeDevPnP.Core.Tests.AppModelExtensions.NavigationExtensionsTests.DeleteTopNavigationNodeTest 00:00:00 Test method OfficeDevPnP.Core.Tests.AppModelExtensions.NavigationExtensionsTests.DeleteTopNavigationNodeTest threw exception: System.InvalidOperationException: Sequence contains more than one matching element
OfficeDevPnP.Core.Tests.Framework.Functional.TermGroupNoScriptTests.WebTermGroupTest 00:01:10 Test method OfficeDevPnP.Core.Tests.Framework.Functional.TermGroupNoScriptTests.WebTermGroupTest threw exception: Microsoft.SharePoint.Client.ServerException: The request channel timed out attempting to send after 00:00:30. Increase the timeout value passed to the call to Request or increase the SendTimeout value on the Binding. The time allotted to this operation may have been a portion of a longer timeout.
OfficeDevPnP.Core.Tests.Framework.Functional.TermGroupNoScriptTests.SiteCollectionTermGroupTest 00:03:08 Test method OfficeDevPnP.Core.Tests.Framework.Functional.TermGroupNoScriptTests.SiteCollectionTermGroupTest threw exception: Microsoft.SharePoint.Client.ServerException: The request channel timed out while waiting for a reply after 00:00:29.9843686. Increase the timeout value passed to the call to Request or increase the SendTimeout value on the Binding. The time allotted to this operation may have been a portion of a longer timeout.
OfficeDevPnP.Core.Tests.Framework.Functional.RegionalSettingsNoScriptTests.WebRegionalSettingsTest 00:00:31 Test method OfficeDevPnP.Core.Tests.Framework.Functional.RegionalSettingsNoScriptTests.WebRegionalSettingsTest threw exception: Microsoft.SharePoint.Client.ServerException: The request channel timed out attempting to send after 00:00:30. Increase the timeout value passed to the call to Request or increase the SendTimeout value on the Binding. The time allotted to this operation may have been a portion of a longer timeout.
OfficeDevPnP.Core.Tests.Framework.Functional.RegionalSettingsNoScriptTests.SiteCollectionRegionalSettingsTest 00:00:52 Test method OfficeDevPnP.Core.Tests.Framework.Functional.RegionalSettingsNoScriptTests.SiteCollectionRegionalSettingsTest threw exception: Microsoft.SharePoint.Client.ServerException: The request channel timed out attempting to send after 00:00:30. Increase the timeout value passed to the call to Request or increase the SendTimeout value on the Binding. The time allotted to this operation may have been a portion of a longer timeout.
OfficeDevPnP.Core.Tests.Framework.Functional.ListTests.Web1605ListAddingTest 00:01:17 Assert.IsTrue failed.
OfficeDevPnP.Core.Tests.Framework.Functional.ListTests.SiteCollection1605ListAddingTest 00:01:37 Assert.IsTrue failed.
OfficeDevPnP.Core.Tests.Framework.ObjectHandlers.ObjectTermGroupsTests.CanProvisionObjects 00:00:05 Test method OfficeDevPnP.Core.Tests.Framework.ObjectHandlers.ObjectTermGroupsTests.CanProvisionObjects threw exception: Microsoft.SharePoint.Client.CollectionNotInitializedException: The collection has not been initialized. It has not been requested or the request has not been executed. It may need to be explicitly requested.
OfficeDevPnP.Core.Tests.Framework.Providers.XMLProvidersTests.XMLSerializer_Deserialize_UnavailableExtensibilityHandlersThrowsException_201512 00:00:00 Test method OfficeDevPnP.Core.Tests.Framework.Providers.XMLProvidersTests.XMLSerializer_Deserialize_UnavailableExtensibilityHandlersThrowsException_201512 did not throw an exception. An exception was expected by attribute Microsoft.VisualStudio.TestTools.UnitTesting.ExpectedExceptionAttribute defined on the test method.
Page 1 of 2

Notfound tests
Result Test Duration Error
No data found