Test run details - MTFirstReleaseAppOnly - 8/10/2018 2:07:28 AM

Failed Tests | Skipped Tests | Notfound Tests | Passed Tests

Failed tests
Result Test      Search Duration Error
OfficeDevPnP.Core.Tests.AppModelExtensions.NavigationExtensionsTests.DeleteSearchNavigationNodeTest 00:00:00 Test method OfficeDevPnP.Core.Tests.AppModelExtensions.NavigationExtensionsTests.DeleteSearchNavigationNodeTest threw exception: System.InvalidOperationException: Sequence contains more than one matching element
OfficeDevPnP.Core.Tests.AppModelExtensions.NavigationExtensionsTests.DeleteTopNavigationNodeTest 00:00:01 Test method OfficeDevPnP.Core.Tests.AppModelExtensions.NavigationExtensionsTests.DeleteTopNavigationNodeTest threw exception: System.InvalidOperationException: Sequence contains more than one matching element
OfficeDevPnP.Core.Tests.AppModelExtensions.BrandingExtensionsTests.DeployThemeAndCreateComposedLookTest 00:00:57 Test method OfficeDevPnP.Core.Tests.AppModelExtensions.BrandingExtensionsTests.DeployThemeAndCreateComposedLookTest threw exception: System.IO.FileNotFoundException: Could not find file 'C:\Users\pnpadmin.PNP\AppData\Local\Temp\custombg.jpg'.
OfficeDevPnP.Core.Tests.Framework.Functional.ListTests.Web1605ListAddingTest 00:01:00 Assert.IsTrue failed.
OfficeDevPnP.Core.Tests.Framework.Functional.ListTests.SiteCollection1605ListAddingTest 00:01:02 Assert.IsTrue failed.
Page 1 of 1

Skipped tests
Result Test      Search Duration Error
OfficeDevPnP.Core.Tests.Sites.SiteCollectionTests.CreateCommunicationSiteTestAsync 00:00:00 Assert.Inconclusive failed. Test that require modern site collection creation are not supported in app-only.
OfficeDevPnP.Core.Tests.AppModelExtensions.TenantExtensionsTests.GetUserProfileServiceClientTest 00:00:00 Assert.Inconclusive failed. Web service tests are not supported when testing using app-only
OfficeDevPnP.Core.Tests.AppModelExtensions.TenantExtensionsTests.GetOneDriveSiteCollectionsTest 00:00:00 Assert.Inconclusive failed. Web service tests are not supported when testing using app-only
OfficeDevPnP.Core.Tests.AppModelExtensions.FileFolderExtensionsTests.UploadFileWebDavTest 00:00:02 Assert.Inconclusive failed. Tests involving webdav are not supported when testing using app-only
OfficeDevPnP.Core.Tests.AppModelExtensions.SearchExtensionsTests.TestSiteSearchTest 00:00:00 Assert.Inconclusive failed. Search tests are not supported when testing using app-only
OfficeDevPnP.Core.Tests.AppModelExtensions.SearchExtensionsTests.GetSearchConfigurationFromSiteTest 00:00:00 Assert.Inconclusive failed. Search tests are not supported when testing using app-only
OfficeDevPnP.Core.Tests.AppModelExtensions.SearchExtensionsTests.GetSearchConfigurationFromWebTest 00:00:00 Assert.Inconclusive failed. Search tests are not supported when testing using app-only
OfficeDevPnP.Core.Tests.AppModelExtensions.SearchExtensionsTests.SetSiteCollectionSearchCenterUrlTest 00:00:00 Assert.Inconclusive failed. Search tests are not supported when testing using app-only
OfficeDevPnP.Core.Tests.Framework.Functional.SearchSettingTests.Web1605SearchSettingsTest 00:00:00 Assert.Inconclusive failed. Test that require search settings are not supported in app-only.
OfficeDevPnP.Core.Tests.Framework.Functional.SearchSettingTests.SiteCollection1605SearchSettingsTest 00:00:00 Assert.Inconclusive failed. Test that require search settings are not supported in app-only.
Page 1 of 7

Notfound tests
Result Test Duration Error
No data found