Test run details - MTFirstReleaseCredentials - 8/9/2018 9:40:34 PM

Failed Tests | Skipped Tests | Notfound Tests | Passed Tests

Failed tests
Result Test      Search Duration Error
OfficeDevPnP.Core.Tests.AppModelExtensions.NavigationExtensionsTests.DeleteSearchNavigationNodeTest 00:00:00 Test method OfficeDevPnP.Core.Tests.AppModelExtensions.NavigationExtensionsTests.DeleteSearchNavigationNodeTest threw exception: System.InvalidOperationException: Sequence contains more than one matching element
OfficeDevPnP.Core.Tests.AppModelExtensions.NavigationExtensionsTests.DeleteTopNavigationNodeTest 00:00:00 Test method OfficeDevPnP.Core.Tests.AppModelExtensions.NavigationExtensionsTests.DeleteTopNavigationNodeTest threw exception: System.InvalidOperationException: Sequence contains more than one matching element
OfficeDevPnP.Core.Tests.AppModelExtensions.TenantExtensionsTests.CheckIfSiteExistsTest 00:00:00 Assert.IsTrue failed.
OfficeDevPnP.Core.Tests.AppModelExtensions.BrandingExtensionsTests.DeployThemeAndCreateComposedLookTest 00:00:48 Test method OfficeDevPnP.Core.Tests.AppModelExtensions.BrandingExtensionsTests.DeployThemeAndCreateComposedLookTest threw exception: System.IO.FileNotFoundException: Could not find file 'C:\Users\pnpadmin.PNP\AppData\Local\Temp\custombg.jpg'.
OfficeDevPnP.Core.Tests.Framework.Functional.TermGroupTests.WebTermGroupTest 00:00:34 Assert.IsTrue failed.
OfficeDevPnP.Core.Tests.Framework.Functional.TermGroupTests.SiteCollectionTermGroupTest 00:00:44 Assert.IsTrue failed.
OfficeDevPnP.Core.Tests.Framework.Functional.TermGroupNoScriptTests.WebTermGroupTest 00:00:33 Assert.IsTrue failed.
OfficeDevPnP.Core.Tests.Framework.Functional.TermGroupNoScriptTests.SiteCollectionTermGroupTest 00:00:48 Assert.IsTrue failed.
OfficeDevPnP.Core.Tests.Framework.Functional.FieldTests.SiteCollectionFieldAddingTest 00:00:54 Assert.IsTrue failed.
OfficeDevPnP.Core.Tests.Framework.Functional.ContentTypeTests.SiteCollectionContentTypeAddingTest 00:01:01 Test method OfficeDevPnP.Core.Tests.Framework.Functional.ContentTypeTests.SiteCollectionContentTypeAddingTest threw exception: Microsoft.SharePoint.Client.ServerException: Unknown Error
Page 1 of 2

Notfound tests
Result Test Duration Error
No data found