Test run details - MTFirstReleaseCredentials - 8/8/2018 9:40:41 PM

Failed Tests | Skipped Tests | Notfound Tests | Passed Tests

Failed tests
Result Test      Search Duration Error
OfficeDevPnP.Core.Tests.AppModelExtensions.NavigationExtensionsTests.DeleteSearchNavigationNodeTest 00:00:00 Test method OfficeDevPnP.Core.Tests.AppModelExtensions.NavigationExtensionsTests.DeleteSearchNavigationNodeTest threw exception: System.InvalidOperationException: Sequence contains more than one matching element
OfficeDevPnP.Core.Tests.AppModelExtensions.NavigationExtensionsTests.DeleteTopNavigationNodeTest 00:00:00 Test method OfficeDevPnP.Core.Tests.AppModelExtensions.NavigationExtensionsTests.DeleteTopNavigationNodeTest threw exception: System.InvalidOperationException: Sequence contains more than one matching element
OfficeDevPnP.Core.Tests.AppModelExtensions.BrandingExtensionsTests.DeployThemeAndCreateComposedLookTest 00:00:46 Test method OfficeDevPnP.Core.Tests.AppModelExtensions.BrandingExtensionsTests.DeployThemeAndCreateComposedLookTest threw exception: System.IO.FileNotFoundException: Could not find file 'C:\Users\pnpadmin.PNP\AppData\Local\Temp\custombg.jpg'.
OfficeDevPnP.Core.Tests.Framework.Functional.TermGroupTests.WebTermGroupTest 00:00:34 Assert.IsTrue failed.
OfficeDevPnP.Core.Tests.Framework.Functional.TermGroupTests.SiteCollectionTermGroupTest 00:00:46 Assert.IsTrue failed.
OfficeDevPnP.Core.Tests.Framework.Functional.TermGroupNoScriptTests.WebTermGroupTest 00:00:31 Assert.IsTrue failed.
OfficeDevPnP.Core.Tests.Framework.Functional.TermGroupNoScriptTests.SiteCollectionTermGroupTest 00:00:44 Assert.IsTrue failed.
OfficeDevPnP.Core.Tests.Framework.Functional.LocalizationNoScriptTest.WebLocalizationTest 00:00:38 Assert.IsTrue failed.
OfficeDevPnP.Core.Tests.Framework.Functional.FieldTests.SiteCollectionFieldAddingTest 00:00:51 Assert.IsTrue failed.
OfficeDevPnP.Core.Tests.Framework.Functional.ListTests.Web1605ListAddingTest 00:00:59 Assert.IsTrue failed.
Page 1 of 2

Notfound tests
Result Test Duration Error
No data found