Test run details - MTFirstReleaseCredentials - 7/11/2018 9:33:55 PM

Failed Tests | Skipped Tests | Notfound Tests | Passed Tests

Failed tests
Result Test      Search Duration Error
OfficeDevPnP.Core.Tests.AppModelExtensions.NavigationExtensionsTests.DeleteSearchNavigationNodeTest 00:00:01 Test method OfficeDevPnP.Core.Tests.AppModelExtensions.NavigationExtensionsTests.DeleteSearchNavigationNodeTest threw exception: System.InvalidOperationException: Sequence contains more than one matching element
OfficeDevPnP.Core.Tests.AppModelExtensions.NavigationExtensionsTests.DeleteTopNavigationNodeTest 00:00:00 Test method OfficeDevPnP.Core.Tests.AppModelExtensions.NavigationExtensionsTests.DeleteTopNavigationNodeTest threw exception: System.InvalidOperationException: Sequence contains more than one matching element
OfficeDevPnP.Core.Tests.AppModelExtensions.BrandingExtensionsTests.DeployThemeAndCreateComposedLookTest 00:02:50 Test method OfficeDevPnP.Core.Tests.AppModelExtensions.BrandingExtensionsTests.DeployThemeAndCreateComposedLookTest threw exception: System.IO.FileNotFoundException: Could not find file 'C:\Users\pnpadmin.PNP\AppData\Local\Temp\custombg.jpg'.
OfficeDevPnP.Core.Tests.Framework.Functional.TermGroupTests.WebTermGroupTest 00:01:31 Assert.IsTrue failed.
OfficeDevPnP.Core.Tests.Framework.Functional.TermGroupTests.SiteCollectionTermGroupTest 00:00:55 Test method OfficeDevPnP.Core.Tests.Framework.Functional.TermGroupTests.SiteCollectionTermGroupTest threw exception: Microsoft.SharePoint.Client.ServerException: The request channel timed out while waiting for a reply after 00:00:30. Increase the timeout value passed to the call to Request or increase the SendTimeout value on the Binding. The time allotted to this operation may have been a portion of a longer timeout.
OfficeDevPnP.Core.Tests.Framework.Functional.TermGroupNoScriptTests.WebTermGroupTest 00:00:30 Assert.IsTrue failed.
OfficeDevPnP.Core.Tests.Framework.Functional.TermGroupNoScriptTests.SiteCollectionTermGroupTest 00:00:41 Assert.IsTrue failed.
OfficeDevPnP.Core.Tests.Framework.Functional.RegionalSettingsNoScriptTests.WebRegionalSettingsTest N/A Class Initialization method OfficeDevPnP.Core.Tests.Framework.Functional.RegionalSettingsNoScriptTests.ClassInit threw exception. System.Threading.ThreadAbortException: System.Threading.ThreadAbortException: Thread was being aborted..
OfficeDevPnP.Core.Tests.Framework.Functional.RegionalSettingsNoScriptTests.SiteCollectionRegionalSettingsTest N/A Test 'SiteCollectionRegionalSettingsTest' exceeded execution timeout period.
OfficeDevPnP.Core.Tests.Framework.Functional.FieldTests.SiteCollectionFieldAddingTest 00:00:53 Assert.IsTrue failed.
Page 1 of 2

Notfound tests
Result Test Duration Error
No data found