Test run details - AzureVMSP2016AppOnly - 7/11/2018 8:00:50 PM

Failed Tests | Skipped Tests | Notfound Tests | Passed Tests

Failed tests
Result Test      Search Duration Error
Microsoft.SharePoint.Client.Tests.FieldAndContentTypeExtensionsTests.CanAddContentTypeAndMakeVisibleInNewButton 00:00:03 Test method Microsoft.SharePoint.Client.Tests.FieldAndContentTypeExtensionsTests.CanAddContentTypeAndMakeVisibleInNewButton threw exception: Microsoft.IdentityModel.SecurityTokenService.RequestFailedException: Token request failed. ---> System.Net.WebException: The remote server returned an error: (401) Unauthorized. TestCleanup method Microsoft.SharePoint.Client.Tests.FieldAndContentTypeExtensionsTests.Cleanup threw exception. Microsoft.IdentityModel.SecurityTokenService.RequestFailedException: Microsoft.IdentityModel.SecurityTokenService.RequestFailedException: Token request failed. ---> System.Net.WebException: The remote server returned an error: (401) Unauthorized..
Microsoft.SharePoint.Client.Tests.FieldAndContentTypeExtensionsTests.CanUpdateDefaultContentTypeWithoutModifyingContentTypeNewButtonVisibility 00:00:13 TestCleanup method Microsoft.SharePoint.Client.Tests.FieldAndContentTypeExtensionsTests.Cleanup threw exception. System.Net.WebException: System.Net.WebException: The underlying connection was closed: An unexpected error occurred on a receive. ---> System.IO.IOException: Unable to read data from the transport connection: An existing connection was forcibly closed by the remote host. ---> System.Net.Sockets.SocketException: An existing connection was forcibly closed by the remote host.
Page 1 of 1

Skipped tests
Result Test Duration Error
No data found

Notfound tests
Result Test Duration Error
No data found