Test run details - MTFirstReleaseCredentials - 6/12/2018 9:25:25 PM

Failed Tests | Skipped Tests | Notfound Tests | Passed Tests

Failed tests
Result Test      Search Duration Error
OfficeDevPnP.Core.Tests.AppModelExtensions.NavigationExtensionsTests.DeleteSearchNavigationNodeTest 00:00:00 Test method OfficeDevPnP.Core.Tests.AppModelExtensions.NavigationExtensionsTests.DeleteSearchNavigationNodeTest threw exception: System.InvalidOperationException: Sequence contains more than one matching element
OfficeDevPnP.Core.Tests.AppModelExtensions.NavigationExtensionsTests.DeleteTopNavigationNodeTest 00:00:00 Test method OfficeDevPnP.Core.Tests.AppModelExtensions.NavigationExtensionsTests.DeleteTopNavigationNodeTest threw exception: System.InvalidOperationException: Sequence contains more than one matching element
OfficeDevPnP.Core.Tests.AppModelExtensions.TenantExtensionsTests.SetSiteLockStateTest 00:02:10 Test method OfficeDevPnP.Core.Tests.AppModelExtensions.TenantExtensionsTests.SetSiteLockStateTest threw exception: Microsoft.SharePoint.Client.ServerException: Cannot set properties on site https://bertonline.sharepoint.com/sites/TestPnPSC_123456789_630dece2-e12a-4d0d-bc86-8c4273920502 because the site is not currently available.
OfficeDevPnP.Core.Tests.AppModelExtensions.BrandingExtensionsTests.DeployThemeAndCreateComposedLookTest 00:01:32 Test method OfficeDevPnP.Core.Tests.AppModelExtensions.BrandingExtensionsTests.DeployThemeAndCreateComposedLookTest threw exception: System.IO.FileNotFoundException: Could not find file 'C:\Users\pnpadmin.PNP\AppData\Local\Temp\custombg.jpg'.
OfficeDevPnP.Core.Tests.Framework.Functional.TermGroupTests.WebTermGroupTest 00:00:29 Assert.IsTrue failed.
OfficeDevPnP.Core.Tests.Framework.Functional.TermGroupTests.SiteCollectionTermGroupTest 00:00:42 Assert.IsTrue failed.
OfficeDevPnP.Core.Tests.Framework.Functional.TermGroupNoScriptTests.WebTermGroupTest 00:00:31 Assert.IsTrue failed.
OfficeDevPnP.Core.Tests.Framework.Functional.TermGroupNoScriptTests.SiteCollectionTermGroupTest 00:00:45 Assert.IsTrue failed.
OfficeDevPnP.Core.Tests.Framework.Functional.NavigationTests.SiteCollectionNavigationTest 00:11:42 Test 'SiteCollectionNavigationTest' exceeded execution timeout period.
OfficeDevPnP.Core.Tests.Framework.Functional.FieldTests.SiteCollectionFieldAddingTest 00:00:56 Assert.IsTrue failed.
Page 1 of 2

Notfound tests
Result Test Duration Error
No data found