Test run details - MTFirstReleaseAppOnly - 4/16/2018 12:23:11 AM

Failed Tests | Skipped Tests | Notfound Tests | Passed Tests

Failed tests
Result Test      Search Duration Error
OfficeDevPnP.Core.Tests.Sites.ALMTests.DeployRetractAppAsyncTest 00:00:02 Test method OfficeDevPnP.Core.Tests.Sites.ALMTests.DeployRetractAppAsyncTest threw exception: System.Exception: {"error":{"code":"-1, Microsoft.SharePoint.Client.ResourceNotFoundException","message":{"lang":"en-US","value":"Exception of type 'Microsoft.SharePoint.Client.ResourceNotFoundException' was thrown."}}}
OfficeDevPnP.Core.Tests.Sites.ALMTests.DeployRetractAppTest 00:00:02 Test method OfficeDevPnP.Core.Tests.Sites.ALMTests.DeployRetractAppTest threw exception: System.Exception: {"error":{"code":"-1, Microsoft.SharePoint.Client.ResourceNotFoundException","message":{"lang":"en-US","value":"Exception of type 'Microsoft.SharePoint.Client.ResourceNotFoundException' was thrown."}}}
OfficeDevPnP.Core.Tests.Sites.ALMTests.AddRemoveAppTest 00:00:02 Test method OfficeDevPnP.Core.Tests.Sites.ALMTests.AddRemoveAppTest threw exception: System.Exception: {"error":{"code":"-1, Microsoft.SharePoint.Client.ResourceNotFoundException","message":{"lang":"en-US","value":"Exception of type 'Microsoft.SharePoint.Client.ResourceNotFoundException' was thrown."}}}
OfficeDevPnP.Core.Tests.Sites.ALMTests.AddRemoveAppTestAsync 00:00:02 Test method OfficeDevPnP.Core.Tests.Sites.ALMTests.AddRemoveAppTestAsync threw exception: System.Exception: {"error":{"code":"-1, Microsoft.SharePoint.Client.ResourceNotFoundException","message":{"lang":"en-US","value":"Exception of type 'Microsoft.SharePoint.Client.ResourceNotFoundException' was thrown."}}}
OfficeDevPnP.Core.Tests.AppModelExtensions.NavigationExtensionsTests.DeleteSearchNavigationNodeTest 00:00:00 Test method OfficeDevPnP.Core.Tests.AppModelExtensions.NavigationExtensionsTests.DeleteSearchNavigationNodeTest threw exception: System.InvalidOperationException: Sequence contains more than one matching element
OfficeDevPnP.Core.Tests.AppModelExtensions.NavigationExtensionsTests.DeleteTopNavigationNodeTest 00:00:00 Test method OfficeDevPnP.Core.Tests.AppModelExtensions.NavigationExtensionsTests.DeleteTopNavigationNodeTest threw exception: System.InvalidOperationException: Sequence contains more than one matching element
OfficeDevPnP.Core.Tests.AppModelExtensions.BrandingExtensionsTests.DeployThemeAndCreateComposedLookTest 00:01:05 Test method OfficeDevPnP.Core.Tests.AppModelExtensions.BrandingExtensionsTests.DeployThemeAndCreateComposedLookTest threw exception: System.IO.FileNotFoundException: Could not find file 'C:\Users\pnpadmin.PNP\AppData\Local\Temp\custombg.jpg'.
OfficeDevPnP.Core.Tests.Framework.Functional.WorkflowsNoScriptTests.SiteCollectionWorkflowsTest 00:04:21 Test method OfficeDevPnP.Core.Tests.Framework.Functional.WorkflowsNoScriptTests.SiteCollectionWorkflowsTest threw exception: Microsoft.SharePoint.Client.ServerException: System.TimeoutException: The HTTP request has timed out after 200000 milliseconds. ---> System.Net.WebException: The request was aborted: The request was canceled. at System.Net.HttpWebRequest.EndGetResponse(IAsyncResult asyncResult) at Microsoft.Workflow.Client.HttpGetResponseAsyncResult`1.OnGotResponse(IAsyncResult result) --- End of inner exception stack trace --- at Microsoft.Workflow.Common.AsyncResult.End[TAsyncResult](IAsyncResult result) at Microsoft.Workflow.Client.H
OfficeDevPnP.Core.Tests.Framework.Functional.ListTests.Web1705ListAddingTest 00:00:00 Test method OfficeDevPnP.Core.Tests.Framework.Functional.ListTests.Web1705ListAddingTest threw exception: Microsoft.SharePoint.Client.ServerException: Exception from HRESULT: 0x80131904
OfficeDevPnP.Core.Tests.Framework.Functional.ListTests.Web1605ListAddingTest 00:00:00 Test method OfficeDevPnP.Core.Tests.Framework.Functional.ListTests.Web1605ListAddingTest threw exception: Microsoft.SharePoint.Client.ServerException: Exception from HRESULT: 0x80131904
Page 1 of 2

Skipped tests
Result Test      Search Duration Error
OfficeDevPnP.Core.Tests.Sites.SiteCollectionTests.CreateCommunicationSiteTestAsync 00:00:00 Assert.Inconclusive failed. Test that require modern site collection creation are not supported in app-only.
OfficeDevPnP.Core.Tests.AppModelExtensions.TenantExtensionsTests.GetUserProfileServiceClientTest 00:00:00 Assert.Inconclusive failed. Web service tests are not supported when testing using app-only
OfficeDevPnP.Core.Tests.AppModelExtensions.TenantExtensionsTests.GetOneDriveSiteCollectionsTest 00:00:00 Assert.Inconclusive failed. Web service tests are not supported when testing using app-only
OfficeDevPnP.Core.Tests.AppModelExtensions.FileFolderExtensionsTests.UploadFileWebDavTest 00:00:02 Assert.Inconclusive failed. Tests involving webdav are not supported when testing using app-only
OfficeDevPnP.Core.Tests.AppModelExtensions.SearchExtensionsTests.TestSiteSearchTest 00:00:00 Assert.Inconclusive failed. Search tests are not supported when testing using app-only
OfficeDevPnP.Core.Tests.AppModelExtensions.SearchExtensionsTests.GetSearchConfigurationFromSiteTest 00:00:00 Assert.Inconclusive failed. Search tests are not supported when testing using app-only
OfficeDevPnP.Core.Tests.AppModelExtensions.SearchExtensionsTests.GetSearchConfigurationFromWebTest 00:00:00 Assert.Inconclusive failed. Search tests are not supported when testing using app-only
OfficeDevPnP.Core.Tests.AppModelExtensions.SearchExtensionsTests.SetSiteCollectionSearchCenterUrlTest 00:00:00 Assert.Inconclusive failed. Search tests are not supported when testing using app-only
OfficeDevPnP.Core.Tests.Framework.Functional.SearchSettingTests.Web1605SearchSettingsTest 00:00:00 Assert.Inconclusive failed. Test that require search settings are not supported in app-only.
OfficeDevPnP.Core.Tests.Framework.Functional.SearchSettingTests.SiteCollection1605SearchSettingsTest 00:00:00 Assert.Inconclusive failed. Test that require search settings are not supported in app-only.
Page 1 of 7

Notfound tests
Result Test Duration Error
No data found