Test run details - MTFirstReleaseCredentials - 3/12/2018 9:05:09 PM

Failed Tests | Skipped Tests | Notfound Tests | Passed Tests

Failed tests
Result Test      Search Duration Error
OfficeDevPnP.Core.Tests.Sites.SiteCollectionTests.CreateCommunicationSiteTestAsync 00:00:00 Test method OfficeDevPnP.Core.Tests.Sites.SiteCollectionTests.CreateCommunicationSiteTestAsync threw exception: Microsoft.SharePoint.Client.PropertyOrFieldNotInitializedException: The property or field 'Url' has not been initialized. It has not been requested or the request has not been executed. It may need to be explicitly requested. TestCleanup method OfficeDevPnP.Core.Tests.Sites.SiteCollectionTests.CleanUp threw exception. Microsoft.SharePoint.Client.PropertyOrFieldNotInitializedException: Microsoft.SharePoint.Client.PropertyOrFieldNotInitializedException: The property or field 'IsComplete' has not been initialized. It has not been requested or the request has not been executed. It may need to be explicitly requested..
OfficeDevPnP.Core.Tests.Sites.ALMTests.DeployRetractAppAsyncTest 00:00:00 Test method OfficeDevPnP.Core.Tests.Sites.ALMTests.DeployRetractAppAsyncTest threw exception: Microsoft.SharePoint.Client.PropertyOrFieldNotInitializedException: The property or field 'CorporateCatalogUrl' has not been initialized. It has not been requested or the request has not been executed. It may need to be explicitly requested.
OfficeDevPnP.Core.Tests.Sites.ALMTests.DeployRetractAppTest 00:00:00 Test method OfficeDevPnP.Core.Tests.Sites.ALMTests.DeployRetractAppTest threw exception: Microsoft.SharePoint.Client.PropertyOrFieldNotInitializedException: The property or field 'CorporateCatalogUrl' has not been initialized. It has not been requested or the request has not been executed. It may need to be explicitly requested.
OfficeDevPnP.Core.Tests.Sites.ALMTests.AddRemoveAppTest 00:00:00 Test method OfficeDevPnP.Core.Tests.Sites.ALMTests.AddRemoveAppTest threw exception: Microsoft.SharePoint.Client.PropertyOrFieldNotInitializedException: The property or field 'CorporateCatalogUrl' has not been initialized. It has not been requested or the request has not been executed. It may need to be explicitly requested.
OfficeDevPnP.Core.Tests.Sites.ALMTests.AddRemoveAppTestAsync 00:00:00 Test method OfficeDevPnP.Core.Tests.Sites.ALMTests.AddRemoveAppTestAsync threw exception: Microsoft.SharePoint.Client.PropertyOrFieldNotInitializedException: The property or field 'CorporateCatalogUrl' has not been initialized. It has not been requested or the request has not been executed. It may need to be explicitly requested.
OfficeDevPnP.Core.Tests.Sites.ALMTests.GetAvailable 00:00:00 Test method OfficeDevPnP.Core.Tests.Sites.ALMTests.GetAvailable threw exception: Microsoft.SharePoint.Client.PropertyOrFieldNotInitializedException: The property or field 'Url' has not been initialized. It has not been requested or the request has not been executed. It may need to be explicitly requested.
OfficeDevPnP.Core.Tests.Sites.ALMTests.GetAvailableTestAsync 00:00:00 Test method OfficeDevPnP.Core.Tests.Sites.ALMTests.GetAvailableTestAsync threw exception: Microsoft.SharePoint.Client.PropertyOrFieldNotInitializedException: The property or field 'Url' has not been initialized. It has not been requested or the request has not been executed. It may need to be explicitly requested.
OfficeDevPnP.Core.Tests.Authentication.AuthenticationTests.AzureADAuthFullControlPermissionTest N/A Class Initialization method OfficeDevPnP.Core.Tests.Authentication.AuthenticationTests.ClassInit threw exception. Microsoft.SharePoint.Client.CollectionNotInitializedException: Microsoft.SharePoint.Client.CollectionNotInitializedException: The collection has not been initialized. It has not been requested or the request has not been executed. It may need to be explicitly requested..
OfficeDevPnP.Core.Tests.AppModelExtensions.PageExtensionsTests.CreatedPublishingPagesSetsTitleCorrectlyTest 00:03:00 Test method OfficeDevPnP.Core.Tests.AppModelExtensions.PageExtensionsTests.CreatedPublishingPagesSetsTitleCorrectlyTest threw exception: Microsoft.SharePoint.Client.PropertyOrFieldNotInitializedException: The property or field 'ServerRelativeUrl' has not been initialized. It has not been requested or the request has not been executed. It may need to be explicitly requested.
OfficeDevPnP.Core.Tests.AppModelExtensions.PageExtensionsTests.CanCreatePublishedPublishingPageWhenModerationIsDisabledTest 00:03:10 Test method OfficeDevPnP.Core.Tests.AppModelExtensions.PageExtensionsTests.CanCreatePublishedPublishingPageWhenModerationIsDisabledTest threw exception: Microsoft.SharePoint.Client.PropertyOrFieldNotInitializedException: The property or field 'ServerRelativeUrl' has not been initialized. It has not been requested or the request has not been executed. It may need to be explicitly requested.

Notfound tests
Result Test Duration Error
No data found