Test run details - MTFirstReleaseAppOnly - 3/12/2018 3:10:26 AM

Failed Tests | Skipped Tests | Notfound Tests | Passed Tests

Failed tests
Result Test      Search Duration Error
OfficeDevPnP.Core.Tests.Sites.ALMTests.DeployRetractAppAsyncTest 00:00:02 Test method OfficeDevPnP.Core.Tests.Sites.ALMTests.DeployRetractAppAsyncTest threw exception: Microsoft.SharePoint.Client.PropertyOrFieldNotInitializedException: The property or field 'CorporateCatalogUrl' has not been initialized. It has not been requested or the request has not been executed. It may need to be explicitly requested.
OfficeDevPnP.Core.Tests.Sites.ALMTests.DeployRetractAppTest 00:00:00 Test method OfficeDevPnP.Core.Tests.Sites.ALMTests.DeployRetractAppTest threw exception: Microsoft.SharePoint.Client.PropertyOrFieldNotInitializedException: The property or field 'CorporateCatalogUrl' has not been initialized. It has not been requested or the request has not been executed. It may need to be explicitly requested.
OfficeDevPnP.Core.Tests.Sites.ALMTests.AddRemoveAppTest 00:00:00 Test method OfficeDevPnP.Core.Tests.Sites.ALMTests.AddRemoveAppTest threw exception: Microsoft.SharePoint.Client.PropertyOrFieldNotInitializedException: The property or field 'CorporateCatalogUrl' has not been initialized. It has not been requested or the request has not been executed. It may need to be explicitly requested.
OfficeDevPnP.Core.Tests.Sites.ALMTests.AddRemoveAppTestAsync 00:00:00 Test method OfficeDevPnP.Core.Tests.Sites.ALMTests.AddRemoveAppTestAsync threw exception: Microsoft.SharePoint.Client.PropertyOrFieldNotInitializedException: The property or field 'CorporateCatalogUrl' has not been initialized. It has not been requested or the request has not been executed. It may need to be explicitly requested.
OfficeDevPnP.Core.Tests.Sites.ALMTests.GetAvailable 00:00:00 Test method OfficeDevPnP.Core.Tests.Sites.ALMTests.GetAvailable threw exception: Microsoft.SharePoint.Client.PropertyOrFieldNotInitializedException: The property or field 'Url' has not been initialized. It has not been requested or the request has not been executed. It may need to be explicitly requested.
OfficeDevPnP.Core.Tests.Sites.ALMTests.GetAvailableTestAsync 00:00:00 Test method OfficeDevPnP.Core.Tests.Sites.ALMTests.GetAvailableTestAsync threw exception: Microsoft.SharePoint.Client.PropertyOrFieldNotInitializedException: The property or field 'Url' has not been initialized. It has not been requested or the request has not been executed. It may need to be explicitly requested.
OfficeDevPnP.Core.Tests.Authentication.AuthenticationTests.AzureADAuthFullControlPermissionTest N/A Class Initialization method OfficeDevPnP.Core.Tests.Authentication.AuthenticationTests.ClassInit threw exception. Microsoft.SharePoint.Client.CollectionNotInitializedException: Microsoft.SharePoint.Client.CollectionNotInitializedException: The collection has not been initialized. It has not been requested or the request has not been executed. It may need to be explicitly requested..
OfficeDevPnP.Core.Tests.AppModelExtensions.PageExtensionsTests.CreatedPublishingPagesSetsTitleCorrectlyTest 00:03:00 Test method OfficeDevPnP.Core.Tests.AppModelExtensions.PageExtensionsTests.CreatedPublishingPagesSetsTitleCorrectlyTest threw exception: Microsoft.SharePoint.Client.PropertyOrFieldNotInitializedException: The property or field 'ServerRelativeUrl' has not been initialized. It has not been requested or the request has not been executed. It may need to be explicitly requested.
OfficeDevPnP.Core.Tests.AppModelExtensions.PageExtensionsTests.CanCreatePublishedPublishingPageWhenModerationIsDisabledTest 00:03:01 Test method OfficeDevPnP.Core.Tests.AppModelExtensions.PageExtensionsTests.CanCreatePublishedPublishingPageWhenModerationIsDisabledTest threw exception: Microsoft.SharePoint.Client.PropertyOrFieldNotInitializedException: The property or field 'ServerRelativeUrl' has not been initialized. It has not been requested or the request has not been executed. It may need to be explicitly requested.
OfficeDevPnP.Core.Tests.AppModelExtensions.PageExtensionsTests.CanCreatePublishedPublishingPageWhenModerationIsEnabledTest 00:03:00 Test method OfficeDevPnP.Core.Tests.AppModelExtensions.PageExtensionsTests.CanCreatePublishedPublishingPageWhenModerationIsEnabledTest threw exception: Microsoft.SharePoint.Client.PropertyOrFieldNotInitializedException: The property or field 'ServerRelativeUrl' has not been initialized. It has not been requested or the request has not been executed. It may need to be explicitly requested.

Skipped tests
Result Test      Search Duration Error
OfficeDevPnP.Core.Tests.Sites.SiteCollectionTests.CreateCommunicationSiteTestAsync 00:00:00 Assert.Inconclusive failed. Test that require modern site collection creation are not supported in app-only.
OfficeDevPnP.Core.Tests.AppModelExtensions.SearchExtensionsTests.TestSiteSearchTest 00:00:00 Assert.Inconclusive failed. Search tests are not supported when testing using app-only
OfficeDevPnP.Core.Tests.AppModelExtensions.SearchExtensionsTests.GetSearchConfigurationFromSiteTest 00:00:00 Assert.Inconclusive failed. Search tests are not supported when testing using app-only
OfficeDevPnP.Core.Tests.AppModelExtensions.SearchExtensionsTests.GetSearchConfigurationFromWebTest 00:00:00 Assert.Inconclusive failed. Search tests are not supported when testing using app-only
OfficeDevPnP.Core.Tests.AppModelExtensions.SearchExtensionsTests.SetSiteCollectionSearchCenterUrlTest 00:00:00 Assert.Inconclusive failed. Search tests are not supported when testing using app-only
OfficeDevPnP.Core.Tests.Framework.ObjectHandlers.ObjectTermGroupsTests.CanProvisionReusableTerms 00:00:00 Assert.Inconclusive failed. Taxonomy tests are not supported when testing using app-only
OfficeDevPnP.Core.Tests.Framework.ObjectHandlers.ObjectTermGroupsTests.CanProvisionObjects 00:00:00 Assert.Inconclusive failed. Taxonomy tests are not supported when testing using app-only
OfficeDevPnP.Core.Tests.Framework.ObjectHandlers.ObjectTermGroupsTests.CanProvisionToSiteCollectionTermGroupUsingToken 00:00:00 Assert.Inconclusive failed. Taxonomy tests are not supported when testing using app-only
OfficeDevPnP.Core.Tests.Framework.Providers.BaseTemplateTests.DumpSingleTemplate N/A
OfficeDevPnP.Core.Tests.Framework.Providers.BaseTemplateTests.DumpBaseTemplates N/A
Page 1 of 5

Notfound tests
Result Test Duration Error
No data found