Test run details - MTFirstReleaseCredentials - 2/11/2018 6:17:39 PM

Failed Tests | Skipped Tests | Notfound Tests | Passed Tests

Failed tests
Result Test      Search Duration Error
OfficeDevPnP.Core.Tests.Sites.ALMTests.AddRemoveAppTest 00:00:02 Test method OfficeDevPnP.Core.Tests.Sites.ALMTests.AddRemoveAppTest threw exception: System.Exception: {"error":{"code":"-1, Microsoft.SharePoint.Client.ResourceNotFoundException","message":{"lang":"en-US","value":"Exception of type 'Microsoft.SharePoint.Client.ResourceNotFoundException' was thrown."}}}
OfficeDevPnP.Core.Tests.Sites.ALMTests.AddRemoveAppTestAsync 00:00:04 Test method OfficeDevPnP.Core.Tests.Sites.ALMTests.AddRemoveAppTestAsync threw exception: System.Exception: {"error":{"code":"-1, Microsoft.SharePoint.Client.ResourceNotFoundException","message":{"lang":"en-US","value":"Exception of type 'Microsoft.SharePoint.Client.ResourceNotFoundException' was thrown."}}}
OfficeDevPnP.Core.Tests.Framework.Functional.WorkflowsNoScriptTests.WebWorkflowsTest N/A Class Initialization method OfficeDevPnP.Core.Tests.Framework.Functional.WorkflowsNoScriptTests.ClassInit threw exception. System.Threading.ThreadAbortException: System.Threading.ThreadAbortException: Thread was being aborted..
OfficeDevPnP.Core.Tests.Framework.Functional.WorkflowsNoScriptTests.SiteCollectionWorkflowsTest N/A Test 'SiteCollectionWorkflowsTest' exceeded execution timeout period.
OfficeDevPnP.Core.Tests.Framework.Functional.WebSettingsTests.WebWebSettingsTest N/A Class Initialization method OfficeDevPnP.Core.Tests.Framework.Functional.WebSettingsTests.ClassInit threw exception. System.Threading.ThreadAbortException: System.Threading.ThreadAbortException: Thread was being aborted..
OfficeDevPnP.Core.Tests.Framework.Functional.WebSettingsTests.SiteCollectionAuditSettingsTest N/A Class Initialization method OfficeDevPnP.Core.Tests.Framework.Functional.WebSettingsTests.ClassInit threw exception. System.Threading.ThreadAbortException: System.Threading.ThreadAbortException: Thread was being aborted..
OfficeDevPnP.Core.Tests.Framework.Functional.WebSettingsTests.SiteCollectionWebSettingsTest N/A Test 'SiteCollectionWebSettingsTest' exceeded execution timeout period.
OfficeDevPnP.Core.Tests.Framework.Functional.ComposedLookTest.SiteCollectionComposedLookTest 00:10:50
Page 1 of 1

Notfound tests
Result Test Duration Error
No data found